##TITLE=$$ Begin of the data block
##JCAMP-DX=5.00 $$ ACD/SpecManager v 10.08
##SPECTROMETER/DATA SYSTEM=Varian
##DATE=07 Jan 2013 10:17:36
##DATA TYPE=INFRARED SPECTRUM
##DATA CLASS=XYDATA
##ORIGIN=
##OWNER=
##NPOINTS=3735
##FIRSTX=399.26403809
##LASTX=4000.35498047
##MAXX=4000.35498047
##MINX=399.26403809
##MAXY=70.61128998
##MINY=0.00000100
##XFACTOR=1.0000000000
##YFACTOR=0.000000100000000
##FIRSTY=0.00000100
##DELTAX=0.96440572
##XUNITS=1/CM
##YUNITS=TRANSMITTANCE
##XYDATA=(X++(Y..Y))
$$ plain form
399.3 10 602954292 499522514 348198204 208938847 200537491 321827278 444641876 454607239
407 454607239 238389645 226849976 353104286 359666595 376200066 391493721 468791504 559333076
414.7 559333076 564806442 443015938 349974518 336998863 330849228 351208458 389614067 488605309
422.4 488605309 490793571 456351662 417010269 349055557 375787544 296023540 239189663 347579498
430.1 347579498 440808220 410113411 329915771 324683990 374667130 316569042 219106178 240655060
437.8 240655060 351199303 486219749 528688087 442150421 320191002 223631859 311960621
444.6 311960621 456753540 424612274 340604591 361080971 315265751 242474785 345606270
451.3 345606270 490431938 361784134 282570076 304387188 335290604 369407959 394817390
$$ packed form
399.3A0O02954282j03431778j51324310j39259357q401356J21289787J22814598R965363
407D54607239k16217594j1539669J26254310O562309J6533471J5293655P7297783R0541572
414.7E59333076N473366j21790504r3041420j2975655o149635K0359230L8405609R8991242
422.4D88605309K188262l4441909l9341393o7954712K6731987p9764004n6833877J08389835
430.1C47579498R3228722l0694809q0197640n231781M9983140n8098088r7462864K1548882
437.8B40655060J10544243J35020446M2468338q6537666j21959419r6559143Q8328762
444.6C11960621J44792919l2141266q4007683K0476380m5815220p2790966J03131485
451.3C45606270J44825668j28647804p9214058K1817112L0903416L4117355K5409431
$$ plain form
458.1 394817390 378260689 341703911 324682808 348618507 414242172 394317589 334714050
464.8 334714050 347465248 315118790 286704845 283165607 279522686 319310474 303656235 258807316
472.6 258807316 294475555 341845131 350178070 338385201 324550209 342651253 390122223 367130585
480.3 367130585 322826958 338951378 347206306 304523602 331842651 395240364 378531113 360655479
488 360655479 345224915 302573452 274708195 285425377 327575226 354973221 374920616 348051567
495.7 348051567 317611217 332356987 328581581 345539131 367595825 326668625 266852379 282208443
503.4 282208443 343304062 377823219 325879745 275153561 332903633 395853462 419989624
510.2 419989624 415895500 349792709 329070969 331576042 320767403 332010651 306946335 265785446
$$ packed form
458.1C94817390j6556701l6556778j7021103K3935699O5623665j9924583n9603539
464.8C34714050J2751198l2346458k8413945l539238l642921L9787788j5654239m4848919
472.6B58807316L5668239M7369576Q332939j1792869j3834992J8101044M7470970k2991638
480.3C67130585m4303627J6124420Q254928m2682704K7319049O3397713j6709251j7875634
488C60655479j5430564m2651463k7865257J0717182M2149849K7397995J9947395k6869049
495.7C48051567l0440350J4745770l775406J6957550K2056694m0927200n9816246J5356064
503.4B82208443O1095619L4519157n1943474n0726184N7750072O2949829K4136162
510.2D19989624m094124o6102791k0721740K505073j0808639J1243248k5064316m1160889
$$ plain form
517.9 265785446 289482574 344436989 340956154 344173775 386920128 387615204 362729073 332015724
525.6 332015724 315579090 309365635 295825043 309251537 335823097 320538673 293524475 288786488
533.3 288786488 290580940 312629299 348050919 348021965 321944313 310101681 322361183 340285492
541 340285492 343835220 338397369 328231087 314167233 302771740 291527138 295600739 303223305
548.7 303223305 302715168 307355099 306286812 326899757 344193382 338426208 329059868 297947273
556.5 297947273 302466373 334738121 338843575 345277290 365614433 345805588 281359653 271368828
564.2 271368828 310009384 338157921 346138153 335066795 312969894 281842079 299459133 337872391
571.9 337872391 329679146 315684395 321717148 325085449 308040504 311908741 310942249 285481873
$$ packed form
517.9B65785446K3697128N4954415l480835L217621M2746353O95076k4886131l0713349
525.6C32015724j6436634o213455j3540592J3426494K6571560j5284424k7014198m737987
533.3B88786488J794452K2048359L5421620k8954k6077652j1842632J2259502J7924309
541C40285492L549728n437851j0166282j4063854j1395493j1244602M073601P622566
548.7C03223305n08137M639931j068287K0612945J7293625n767174r366340l1112595
556.5B97947273M519100L2271748M105454O433715K0337143j9808845o4445935r990825
564.2B71368828L8640556K8148537P980232j1071358k2096901l1127815J7617054L8413258
571.9C37872391q193245j3994751O032753L368301j7044945L868237r66492k5460376
$$ plain form
579.6 285481873 292954769 310609055 310779285 316349525 313536282 305655670 302350960 309602489
587.3 309602489 318629971 308786926 316027641 328866653 309828129 306117229 326126366 334727592
595 334727592 316149826 295022087 295398026 303739605 307709274 302194767 311871700 322708931
602.8 322708931 301417732 271951675 260592804 273138123 272141190 250736752 245514355 247365437
610.5 247365437 229228401 209158821 209179516 208992348 215671062 225736980 206872730 195063190
618.2 195063190 211779537 218132133 200075111 182420959 173941021 175043392 187505779 192757263
625.9 192757263 172411423 162171688 188867226 217344379 219151783 223587475 247746487 260426826
633.6 260426826 261401367 265702782 252323341 227407665 210273304 213059692 221096096 226894035
$$ packed form
579.6B85481873P472896J7654286J70230N570240k813243p880612l304710P251529
587.3C09602489R027482r843045P240715J2839012j9038524l710900K0009137Q601226
595C34727592j8577766k1127739L75939Q341579L969669n514507R676933J0837231
602.8C22708931k1291199k9466057j1358871J2545319r96933k1404438n222397J851082
610.5B47365437j8137036k0069580K0695j87168O678714J0065918j8864250j1809540
618.2A95063190J6716347O352596j8057022j7654152q479938J102371J2462387N251484
625.9A92757263k0345840j0239735K6695538K8477153J807404M435692K4159012J2680339
633.6B60426826R74541M301415j3379441k4915676j7134361K786388Q036404N797939
$$ plain form
641.3 226894035 242068539 252687931 266805305 291129150 320005188 337444115 334463005 338402367
649 338402367 336834908 334582024 335099525 330530815 333390465 338385315 344207726 345404243 347652130
657.7 347652130 348200569 347092400 347768326 346624298 358996086 372219353 375187340 370574188
665.4 370574188 367632332 376833611 375630226 366520653 368661652 363349571 346909599 347165146
673.2 347165146 361038208 362652512 361732216 375162582 390185623 386349068 383278503 387181664
680.9 387181664 388707008 383462563 387195854 394247742 374295654 369775696 372393684 359464073
688.6 359464073 356409264 358876534 359512177 355753632 362214508 363301353 361374512 362942009 353120422
697.3 353120422 360775948 365412636 354288025 347901688 341806908 337571373 339301262 350718765
$$ packed form
641.3B26894035J5174504J0619392J4117374K4323845K8876038J7438927k981110L939362
649C38402367j567459k252884N17501m568710K859650M994850N822411J196517K247887
657.7C47652130N48439j108169O75926j144028J2371788J3223267K967987m613152
665.4C70574188k941856R201279j203385r109573K140999n312081j6439972K55547
673.2C47165146J3873062J614304r20296J3430366J5023041l836555l070565L903161
680.9C87181664J525344n244445L733291P051888j9952088m519958K617988j2929611
688.6C59464073l054809K467270O35643l758545O460876J086845j926841J567497r821587
697.3C53120422P655526M636688j1124611o386337o094780m235535J729889J1417503
$$ plain form
705 350718765 357482719 356721840 358549576 364505081 364322853 357379570 357999191 363242264 368295364
713.7 368295364 368179283 377852516 384429359 377861595 379605026 373154526 376650696 386966286
721.4 386966286 384105148 388263283 385083771 378126411 378651924 385138206 402831230 413372383
729.1 413372383 401959152 385942955 381579208 378685417 374279594 376353531 375981903 377803230
736.8 377803230 382089424 377790794 384290695 398438072 405472832 409221039 399260559 390779190
744.5 390779190 391183243 391442337 397382507 401767464 402322197 407475243 417422791 423916473 424355011
753.2 424355011 420069962 418496132 419882736 420233345 430232925 436036720 436995430 439833946 430159416
761.9 430159416 425284424 437311554 448609886 455416183 456667519 441262512 428913078 428983498
$$ packed form
705C50718765O763954p60879J827736N955505j82228o943283O19621N243073N053100
713.7C68295364j16081R673233O576843o567764J743431o450500L496170J0315590
721.4C86966286k861138M158135l179512o957360N25513O486282J7693024J0541153
729.1D13372383j1413231j6016197m363747k893791m405823K073937l71628J821327
736.8C77803230M286194m298630O499901J4147377P034760L748207r960480q481369
744.5C90779190M04053K59094N940170M384957N54733N153046R947548O493682M38538
753.2D24355011m285049j573830J386604L50609R999580N803795R58710K838516r674530
761.9D30159416m874992J2027130J1298332O806297J251336j5405007j2349434P0420
$$ plain form
769.6 428983498 435337982 445415993 438375092 428264923 431994667 447652435 454465218 445299339
777.3 445299339 450119667 450813293 451442261 465091171 469403152 472245293 477433701 485808029 488101006
786 488101006 479465408 477459259 479441719 480028572 483108482 484336128 479075890 472058296 472910271
794.7 472910271 472411957 463496017 470181541 483157310 486956940 492960777 496277390 500197487
802.4 500197487 497977333 490593719 484881744 479775085 477908173 473044395 480971527 490500755
810.1 490500755 487256393 481268768 469951515 474810638 487620964 491386452 500712051 503208008
817.8 503208008 497839661 500752068 495626755 486686211 483478394 484120712 491712570 484375687 481357307
826.5 481357307 488080482 479198532 474406586 476953926 478468056 468468399 460943642 461896477 454606400
$$ packed form
769.6D28983498O354484J0078011p040901j0110169L729744J5657768O812783r165879
777.3D45299339M820328O93626O28968J3648910M311981K842141N188408Q374328K292977
786D88101006q635598k006149J982460N86853L079910J227646n260238p017594Q51975
794.7D72910271m98314q915940O685524J2975769L799630O003837L316613L920097
802.4E00197487k220154p383614n711975n106659j866912m863778P927132R529228
810.1D90500755l244362n987625j1317253M859123J2810326L765488R325599K495957
817.8E03208008n368347K912407n125313q940544l207817O42318P591858p336883l018380
826.5D81357307O723175q881950m791946K547340J514130r999657p524757R52835p290077
$$ plain form
835.2 454606400 449706650 439480476 426760635 411489410 397713623 397549667 395401611 391640625
842.9 391640625 384373016 384432602 389801865 387939186 390333061 388699570 384955902 377974434 379126091
851.6 379126091 397283859 407800026 414066238 413562012 411387024 422493477 425049515 422213211
859.3 422213211 430809441 434363060 436536980 448463898 452435989 449739037 447096901 442009544
867 442009544 439858780 441967239 451339760 461103325 458142738 457802544 467194519 468605461 465455475
875.7 465455475 464867363 469722214 473813782 464699593 459976501 460946808 459496765 463059387 461837997
884.4 461837997 453888664 443765488 437597733 442490845 446501236 446160583 442186852 433031349
892.1 433031349 430786781 435914536 441744156 445230446 446681747 448763046 449407997 447514534 437872505
$$ packed form
835.2D54606400m899750j0226174j2719841j5271225j3775787j63956k148056l760986
842.9C91640625p267609N9586N369263j862679K393875j633491l743668o981468J151657
851.6C79126091J8157768J0516167O266212n04226k174988J1106453K556038k836304
859.3D22213211Q596230L553619K173920J1926918L972091k696952k642136n087357
867D42009544k150764K108459R372521R763565k960587l40194R391975J410942l149986
875.7D65455475n88112M854851M091568r114189m723092R70307j450043L562622j221390
884.4D61837997p949333j0123176o167755M893112M010391l40653l973731r155503
892.1D33031349k244568N127755N829620L486290J451301K081299O44951j893463r642029
$$ plain form
900.8 437872505 429994278 435195694 444561882 447413597 439332581 434505653 434329147 428062172 427121315
909.4 427121315 434645729 434356308 423345261 416196022 408907776 399171524 393719597 385684357
917.2 385684357 377495079 372579193 370648994 374462662 376855278 368068695 358586426 358001328 354357986
925.8 354357986 348038521 343847923 346413841 352454147 345481224 340128937 346648483 351513481
933.6 351513481 349928818 347446556 351113853 356958160 361553650 362342224 366005783 378380928
941.3 378380928 384013367 383475266 391616745 403719978 404388084 402533264 409972153 414473343 417941055
949.9 417941055 427722168 431010056 426826744 424826775 425480957 425422516 424361763 424718971 421373482
958.6 421373482 415843887 413872795 410215378 404565964 400690079 395952721 389076004 386024437
$$ packed form
900.8D37872505p878227N201416R366188K851715q081016m826928j76506o266975r40857
909.4D27121315P524414k89421j1011047p149239p288246r736252n451927q035240
917.2C85684357q189278m915886j930199L813668K392616q786583r482269n85098l643342
925.8C54357986o319465m190598K565918O040306o972923n352287O519546M864998
933.6C51513481j584663k482262L667297N844307M595490P88574L663559J2375145
941.3C78380928N632439n38101Q141479J2103233O68106j854820P438889M501190L467712
949.9D17941055R781113L287888m183312j999969O54182n8441j060753L57208l345489
958.6D21373482n529595j971092l657417n649414l875885m737358o876717l051567
$$ plain form
966.3 386024437 385642548 383422127 380709229 378417282 376786003 370579605 366911850 371724739 373761749
975 373761749 374537849 376003914 374754257 370671997 362845650 356090546 353803596 353838959 357293625
983.7 357293625 360603561 353179245 344370804 344313545 343167458 337930260 328581314 319177551 312772408
992.4 312772408 302161846 288145809 271639061 258206310 260363369 274565010 290656452 301150551
1000.1 301150551 299749336 293340511 295554409 299933891 294842358 287570496 289984608 296542912
1007.8 296542912 295421028 294812565 296096249 292394543 289950790 284163170 275693588 271373253
1015.5 271373253 268368530 269423542 269375782 265173817 263675175 256517487 243858738 242022724
1023.2 242022724 248037987 253300800 255668564 250998039 242654457 237529831 237750244 233291473
$$ packed form
966.3C86024437l81889k220421k712898k291947j631279o206398l667755M812889K037010
975C73761749P76100J466065j249657m082260p826347o755104k286950L5363L454666
983.7C57293625L309936p424316q808441n7259j146087n237198r348946r403763o405143
992.4C12772408j0610562j4016037j6506748j3432751K157059J4201641J6091442J0494099
1000.1C01150551j401215o408825K213898M379482n091533p271862K414112O558304
1007.8B96542912j121884o08463J283684l701706k443753n787620q469582m320335
1015.5B71373253l004723J055012m7760m201965j498642p157688j2658749j836014
1023.2B42022724O015263N262813K367764m670525q343582n124626K20413m458771
$$ plain form
1031 233291473 224759846 224667892 228778286 229888382 220703545 213152618 217178211 219282627 218590164
1039.6 218590164 215588570 215436363 218254490 219299507 222720604 221775150 219044971 213968143 209649429
1048.3 209649429 216013660 218450661 214495068 212383766 214099770 217196960 218944187 220317173
1056 220317173 215048962 209782524 209841175 213313656 219444866 221193829 220478058 220653248 222561512
1064.7 222561512 220257549 217677040 219447479 215055389 211237698 209988728 209082336 212400589
1072.4 212400589 216484718 217498817 211181259 204976044 204976082 202847672 198682251 201743774 202672558
1081.1 202672558 198123455 199677925 199748745 200162659 201220131 197772770 195560417 189741726 184500675
1089.8 184500675 183697853 183283958 181788769 178124428 172761784 168098946 165824661 150417109
$$ packed form
1031B33291473q531627r1954M110394J110096r184837p550927M025593K104416o92463
1039.6B18590164l001594j52207K818127J045017L421097r45454k730179n076828m318714
1048.3B09649429O364231K437001l955593k111302J716004L097190J747227J372986
1056B20317173n268211n266438N8651L472481O131210J748963p15771J75190J908264
1064.7B22561512k303963k580509J770439m392090l817691j248970r06392L318253
1072.4B12400589M084129J014099o317558o205215L8k128410m165421L061523R28784
1081.1B02672558m549103J554470P0820M13914J057472l447361k212353n818691n241051
1089.8A84500675q02822m13895j495189l664341n362644m662838k274285j5407552
$$ plain form
1097.5 150417109 129278049 124919891 125529528 124397249 120856380 109762650 99748478 96174278
1105.2 96174278 93630123 84338360 68781810 65362473 70093980 66525168 63392935 58674083
1112.9 58674083 55069637 52291193 46488671 49209614 52481065 52982635 50849500 49526391 48426723
1121.6 48426723 46403356 52708273 58115754 63028259 62653065 60044637 63554020 61867971 57344513
1130.3 57344513 52529092 52912164 54489031 53005147 52537222 47527933 44854498 46520057 48175969
1139 48175969 50008807 48342376 42306232 37248268 33395703 32506416 36095293 34454238 31975651
1147.6 31975651 31737318 29237878 26267118 25140133 28458166 33144698 32094607 26479850 27067723
1156.3 27067723 28796360 29904628 33886826 36559956 34926178 28934500 33877845 39175620
$$ packed form
1097.5A50417109k1139060m358158O09637j132279l540869j1093730j0014172l574200
1105.2I6174278k544155r291763j5556550l419337M731507l568812l132233m718852
1112.9E8674083l604446k778444n802522K720943L271451N01570k133135j323109j099668
1121.6D8426723k023367O304917N407481M912505l75194k608428L509383j686049m523458
1130.3E7344513m815421L83072J576867j483884m67925n009289k673435J665559J655912
1139D8175969J832838j666431o036144n057964l852565q89287L588877j641055k478587
1147.6C1975651k38333k499440k970760j126985L318033M686532j050091n614757N87873
1156.3B7067723J728637J108268L982198K673130j633778n991678M943345N297775
$$ plain form
1164 39175620 37913013 39930518 39486620 41783905 46285114 48308673 46607175 50803585 61585765
1172.7 61585765 70268145 76461425 76071200 78720198 85156155 93215284 99663992 104177446 110840826
1181.4 110840826 114352732 120698051 123951769 129151421 140148964 145154533 148588381 154419489
1189.1 154419489 160391979 161363697 165308228 170472279 174364166 180872765 184737873 189887486
1196.8 189887486 192804470 200265713 209558067 210116978 211798382 214271564 218105850 223260727
1204.5 223260727 228656445 235655079 240005550 238379021 236289959 240171337 241521435 241151123
1212.3 241151123 245117817 251394367 255679550 254461956 253786507 254892139 256052780 256419888 254810734
1220.9 254810734 256258774 259675426 259286442 257494011 256434689 256166286 260122929 261919403 257366123
$$ packed form
1164C9175620j262607K017505m43898K297285M501209K023559j701498M196410J0782180
1172.7F1585765Q682380O193280l90225K648998O435957Q059129O448708M513454O663380
1181.4A10840826L511906O345319L253718N199652J0997543N005569L433848N831108
1189.1A54419489N972490R71718L944531N164051L891887O508599L865108N149613
1196.8A89887486K916984P461243R292354N58911J681404K473182L834286N154877
1204.5B23260727N395718O998634M350471j626529k089062L881378J350098l70312
1212.3B41151123L966694O276550M285183j217594o75449J105632J160641L67108j609154
1220.9B54810734J448040L416652l88984j792431j059322k68403L956643J796474m553280
$$ plain form
1229.6 257366123 254768448 257526760 259605446 257652473 258087597 260470352 261192455 261617012 263291531
1238.3 263291531 265742626 266727257 267849846 269502029 271243744 270644493 268404198 268427277 270218239
1247 270218239 272070293 270805893 268840656 268679256 270551529 272760315 273148041 272644253 269945412
1255.7 269945412 270043755 273531284 275865860 275497398 273669758 274745216 275297489 274665585 275765553
1264.3 275765553 279145641 280969772 279149742 277679005 276439857 278240585 281878529 285480442
1272 285480442 291160984 294472141 293975792 293563175 295977726 298958073 300858135 302970562 305282784
1280.7 305282784 307826138 309836655 311674366 315149860 318487396 320106506 323151550 327698479
1288.4 327698479 329568748 329792595 332841644 335543175 336330032 339729538 344339294 346389656 346932945
$$ packed form
1229.6B57366123k597675K758312K078686j952973M35124K382755P22103M24557J674519
1238.3B63291531K451095R84631J122589J652183J741715n99251k240295K3079J790962
1247B70218239J852054j264400j965237j61400J872273K208786L87726n03788k698841
1255.7B69945412R8343L487529K334576l68462j827640J075458N52273o31904J099968
1264.3B75765553L380088J824131j820030j470737j239148J800728L637944L601913
1272B85480442N680542L311157m96349m12617K414551K980347J900062K112427K312222
1280.7C05282784K543354K010517J837711L475494L337536J619110L045044M546929
1288.4C27698479J870269K23847L049049K701531P86857L399506M609756K050362N43289
$$ plain form
1297.1 346932945 352524643 358804665 358061447 356266670 357704811 361623154 364193649 365154915 367938576
1305.8 367938576 370283737 371525307 373301353 373124542 371759987 374281960 376651039 377487793 380874519
1314.5 380874519 382202339 379526329 378264389 381597023 384841919 386889763 388396034 386914291
1322.2 386914291 385448151 386477470 386881599 386575890 390668831 395440941 396230202 395535889 394713631
1330.9 394713631 394945335 395112572 394837265 394833488 396973839 398320847 395059776 393590775 394527092
1339.6 394527092 395640411 397473907 398037605 396205025 395516167 396839905 395308723 395035515 396538734
1348.2 396538734 395183296 393531113 393193016 393652916 394068146 393586159 391848030 390197906 389796715
1356.9 389796715 389104576 388060570 388963623 389611702 388466873 390137405 388315125 384083366 384152565
$$ packed form
1297.1C46932945N591698O280022p43218j794777J438141L918343K570495R61266K783661
1305.8C67938576K345161J241570J776046j76811j364555K521973K369079Q36754L386726
1314.5C80874519J327820k676010j261940L332634L244896K047844J506271j481743
1322.2C86914291j466140J029319M04129l05709M092941M772110P89261o94313q22258
1330.9C94713631K31704J67237k75307l777K140351J347008l261071j469001R36317
1339.6C94527092J113319J833496N63698j832580o88858J323738j531182k73208J503219
1348.2C96538734j355438j652183l38097M59900M15230m81987j738129j650124m01191
1356.9C89796715o92139j044006R03053O48079j144829J670532j822280m231759O9199
$$ plain form
1365.6 384152565 384020119 381792908 380916061 382769012 380115814 376256790 378361282 378881760 376379356
1374.3 376379356 375041733 373096199 371884117 371000938 370170212 369143944 367677002 367708817 371528702
1382.9 371528702 373674774 372246513 372224121 370679817 368585587 370041542 371318932 372703133 373539162
1391.6 373539162 373190231 374052277 376103630 373032074 370510445 370861397 370198441 366974983 366293526
1400.3 366293526 367934952 367152252 365012550 362763176 359849510 359167633 358559074 357196312 356834831
1409 356834831 357709351 356363831 353656731 353554764 354922218 355820961 354540443 351707611 348978577
1417.7 348978577 350093536 353539200 353101158 356633415 359306870 356276360 351832085 352575226 354271545
1426.3 354271545 354605217 357552452 360552750 360932045 362440529 361858711 360402107 363278046 365548248
$$ packed form
1365.6C84152565j32446k227211q76847J852951k653198l859024K104492N20478k502404
1374.3C76379356j337623j945534j212082q83179q30726j026268j466942L1815L819885
1382.9C71528702K146072j428261k2392j544304k094230J455955J277390J384201Q36029
1391.6C73539162l48931Q62046K051353l071556k521629L50952o62956l223458o81457
1400.3C66293526J641426p82700k139702k249374k913666o81877o08559j362762l61481
1409C56834831Q74520j345520k707100j01967J367454Q98743j280518k832832k729034
1417.7C48978577J114959L445664m38042L532257K673455l030510m444275P43141J696319
1426.3C54271545L33672K947235L000298L79295J508484n81818j456604K875939K270202
$$ plain form
1435 365548248 365853882 366473274 366846581 369706039 372061501 372910881 373702202 374760742 376442108
1443.7 376442108 377914047 380139656 380518188 379455070 380803871 382591019 383519096 384968300 386184387
1452.4 386184387 385778198 387236176 387835541 388324966 394606972 396879616 397942390 398639488 400383682
1461.1 400383682 399992752 401585693 407599487 411280518 409739418 407074471 406816444 408509865 412315140
1469.7 412315140 417466927 418995819 420091476 424555550 429385757 431315880 432803383 437869072
1477.5 437869072 441872139 444656982 446919632 449963684 452267990 453216553 453258514 455373840 459594650
1486.1 459594650 459288445 456904716 457298470 457457008 458423576 458676872 460420799 459727669 456975632
1494.8 456975632 457980194 454845085 451766052 449454346 446608391 446824493 445659523 442728653
$$ packed form
1435C65548248L05634O19392L73307K859458K355462Q49380P91321J058540J681366
1443.7C76442108J471939K225609L78532j063118J348801J787148R28077J449204J216087
1452.4C86184387m06189J457978N99365M89425O282006K272644J062774O97098J744194
1461.1D00383682l90930J592941O013794L681031j541100k664947k58027J693421L805275
1469.7D12315140N151787J528892J095657M464074M830207J930123J487503N065689
1477.5D37869072M003067K784843K262650L044052K304306R48563M1961K115326M220810
1486.1D59594650l06205k383729L93754J58538R66568K53296J743927o93130k752037
1494.8D56975632J004562l135109l079033k311706k845955K16102j164970k930870
$$ plain form
1502.5 442728653 442132339 444132118 442837334 439550362 432917290 428453369 429638634 426740303
1510.2 426740303 425388794 424127998 422079964 420313797 418953018 418034554 411675720 409227104
1518 409227104 410835838 410518494 405708885 404110794 405479469 405594711 406364746 405057793 406115189
1526.6 406115189 405614624 402646637 400023308 399345703 400382004 400303116 400470314 394957962 393802414
1535.3 393802414 394020004 394189491 397567825 401461754 390621490 384948959 390775757 389370766
1543 389370766 387484322 389075508 388470306 392632332 393469315 392692680 392158699 388954506 392075043
1551.7 392075043 396384506 398139343 395444336 396598206 399838829 402751579 405985451 398399391
1559.4 398399391 398117371 402406731 406401138 411197662 416774483 417004547 414545250 414741707 413923531
$$ packed form
1502.5D42728653n96314J999779j294784l286972o633072m463921J185265k898331
1510.2D26740303j351509j260796k048034j766167j360779r18464o358834k448616
1518D09227104J608734l17344m809609j598091J368675J15242P70035j306953J057396
1526.6D06115189n00565k967987k623329o77605J036301p8888J67198n512352j155548
1535.3C93802414K17590J69487L378334L893929j0840264n672531N826798j404991
1543C89370766j886444J591186o05202M162026Q36983p76635n33981l204193L120537
1551.7C92075043M309463J754837k695007J153870L240623K912750L233872p586060
1559.4C98399391k82020M289360L994407M796524N576821K30064k459297J96457q18176
$$ plain form
1568.1 413923531 416786919 419073334 416851196 417078476 418796158 420295868 419061050 415747757
1575.8 415747757 406158218 409247932 411829948 412269630 412440529 408354416 406899338 406631851 404584465
1584.5 404584465 401811562 399191132 397161636 394253654 392738152 389788322 386846161 383818321
1592.2 383818321 380276985 376062050 372954483 371286659 367643013 365193901 361544304 357610779
1599.9 357610779 352611847 350546570 350205498 346483498 343664627 339476585 337282181 332917404
1607.6 332917404 329652176 328794441 326453552 324039726 318076725 316670589 315412693 314071217
1615.4 314071217 312735023 305648575 302466908 298384476 298842964 296313858 294400158 291949615
1623.1 291949615 286611824 285908794 283399410 283888264 281864262 280912170 278309288 276495399 276414833
$$ packed form
1568.1D13923531K863388K286415k222138K27280J717682J499710j234818l313293
1575.8D15747757r589539L089714K582016M39682J70899m086113j455078k67487k047386
1584.5D04584465k772903k620430k029496k907982j515502k949830k942161l027840
1592.2C83818321l541336m214935l107567j667824l643646k449112l649597l933525
1599.9C57610779m998932k065277l41072l722000k818871m188042k194404m364777
1607.6C32917404l265228q57735k340889k413826n963001j406136j257896j341476
1615.4C14071217j336194p086448l181667m082432M58488k529106j913700k450543
1623.1B91949615n337791p03030k509384M88854k024002r52092k602882j813889q0566
$$ plain form
1631.7 276414833 275736523 277794266 272916718 270024948 268398190 265731602 266651897 266713867 267145653
1640.4 267145653 264668198 265598507 264608898 266000843 268462582 265331383 264417133 261429214 266165943
1649.1 266165943 267277603 270116158 275222912 290053196 284761086 269938450 272290802 274819298
1656.8 274819298 277269955 278420811 279940662 281807461 284420261 290089874 289967804 292937584
1664.5 292937584 294790115 295408001 294896259 295345650 299316692 302998581 312445221 314198284 315235481
1673.2 315235481 316756611 316459446 319853649 323040085 328754692 331187019 335998039 339131737
1680.9 339131737 343088303 352283249 355624542 361595535 359907684 362386742 366036720 369196548
1688.6 369196548 374484291 380064888 386363525 390392265 394898567 400891457 408902664 412996330
$$ packed form
1631.7B76414833o78310K057743m877548k891770j626758k666588R20295O1970M31786
1640.4B67145653k477455R30309r89609J391945K461739l131199r14250k987919M736729
1649.1B66165943J111660K838555N106754J4830284n292110j4822636K352352K528496
1656.8B74819298K450657J150856J519851J866799K612800N669613j22070K969780
1664.5B92937584J852531O17886n11742M49391L971042L681889R446640J753063J037197
1673.2C15235481J521130k97165L394203L186436N714607K432327M811020L133698
1680.9C39131737L956566R194946L341293N970993j687851K479058L649978L159828
1688.6C69196548N287743N580597O298637M028740M506302N992890Q011207M093666
$$ plain form
1696.4 412996330 418005333 425204811 428708496 427524529 437316399 447866707 455634422 463020248
1704.1 463020248 466815033 469238625 475218010 482242546 489239273 491642303 494998856 500958023
1711.8 500958023 504603615 509657822 513093147 515937386 520616837 521573982 519453049 523928452
1719.5 523928452 528360977 529825974 531200218 533071823 534141121 536477318 537851334 538679199
1727.2 538679199 541558418 544859161 546101189 545728455 547302399 550546989 548586769 545369873
1734.9 545369873 552104759 556156998 558232803 561901817 563860054 562884102 566790619 571088142
1742.7 571088142 572630196 573716087 575555649 578222351 582785416 588794212 593215141 596794777
1750.4 596794777 598068352 599763527 605417252 608752060 610900688 614482574 617117958 620346832
$$ packed form
1696.4D12996330N009003P199478L503685j183967R791870J0550308P767715P385826
1704.1D63020248L794785K423592N979385P024536O996727K403030L356553N959167
1711.8E00958023L645592N054207L435325K844239M679451R57145k120933M475403
1719.5E23928452M432525J464997J374244J871605J069298K336197J374016Q27865
1727.2E38679199K879219L300743J242028l72734J573944L244590j960220l216896
1734.9E45369873O734886M052239K075805L669014J958237r75952L906517M297523
1742.7E71088142J542054J085891J839562K666702M563065O008796M420929L579636
1750.4E96794777J273575J695175N653725L334808K148628L581886K635384L228874
$$ plain form
1758.1 620346832 622918091 625030823 627801666 627451172 630801811 634983940 636028442 637812271
1765.8 637812271 639133720 639288902 637982368 639549217 643947678 650080261 652089996 644312439
1773.5 644312439 644094543 646250153 648203354 651425171 652262039 651899643 651073837 651912079 653610535
1782.2 653610535 653342209 654858170 657412720 658476944 660971069 660989532 659070969 660912933 662731247
1790.9 662731247 665237045 663568268 662507172 667114563 667277603 665381775 664114227 665983963
1798.6 665983963 668268890 666302414 669891968 671896515 671849518 671769333 671303406 672007294 670276566
1807.3 670276566 670831451 672977448 673960876 673487778 675102463 678345642 678316116 677933273 676404419
1815.9 676404419 675823212 677417679 679663467 682010498 680721283 679053955 678857498 681001587 685184021
$$ packed form
1758.1F20346832K571259K112732K770843l50494L350639M182129J044502J783829
1765.8F37812271J321449J55182j306534J566849M398461O132583K009735p777557
1773.5F44312439k17896K155610J953201L221817Q36868l62396q25806Q38242J698456
1782.2F53610535k68326J515961K554550J064224K494125J8463j918563J841964J818314
1790.9F62731247K505798j668777j061096M607391J63040j895828j267548J869736
1798.6F65983963K284927j966476L589554K004547m6997q0185m65927P03888j730728
1807.3F70276566N54885K145997R83428m73098J614685L243179k9526l82843j528854
1815.9F76404419n81207J594467K245788K347031j289215j667328j96457K144089M182434
$$ plain form
1824.6 685184021 685099335 683472824 683744125 685172272 687532120 684079437 683449860 687204971 688594131
1833.3 688594131 688587952 688372650 689193344 690784378 689179382 687398834 688309250 690202866 690083008
1842 690083008 691163254 690397186 685941925 689263153 692509155 694457855 693407974 691806259 692218781
1850.7 692218781 693871231 695967560 695112610 695483780 696632156 695685425 694262772 693023453 693710480
1859.3 693710480 695552139 697660065 697304077 696905823 697281418 696763763 698356018 701044006 702423859
1868 702423859 698657227 695951080 698769836 699887085 698355484 697140884 698330612 699888153 700367126
1876.7 700367126 700222168 701582489 701363220 698095093 697899551 699641266 700597610 700701904 701833496
1885.4 701833496 702871399 703284454 705446701 704464035 700375290 700814743 703367996 703860168 702046280
$$ packed form
1824.6F85184021q4686j626511K71301J428147K359848l452683o29577L755111J389160
1833.3F88594131o179k15302Q20694J591034j604996j780548R10416J893616j19858
1842F90083008J080246p66068m455261L321228L246002J948700j049881j601715M12522
1850.7F92218781J652450K096329q54950L71170J148376r46731j422653j239319O87027
1859.3F93710480J841659K107926l55988l98254L75595n17655J592255K687988J379853
1868G02423859l766632k706147K818756J117249j531601j214600J189728J557541M78973
1876.7G00367126j44958J360321k19269l268127j95542J741715R56344J04294J131592
1885.4G01833496J037903M13055K162247r82666m088745M39453K553253M92172j813888
$$ plain form
1894.1 702046280 699812393 699980011 702227478 702328415 702474289 702886963 702521820 702172089 700894699
1902.7 700894699 701519775 703466110 703330536 701048889 699745560 699734116 700461044 702902222 703375320
1911.4 703375320 701944580 700863266 701812439 702973480 703613358 705172882 703722076 701601028 702198715
1920.1 702198715 703930893 706112900 705720520 702724991 701443787 701270523 701486130 702737045 703083344
1928.8 703083344 703017807 702990494 701291809 699432297 700568695 702117233 701557846 702585678 703299789
1937.5 703299789 702908020 701948166 701514893 703681183 702717209 701056366 702491760 703087692 702031021
1946.1 702031021 701212540 702229080 702215652 703149872 705066833 705310211 703533783 701641541 702260513
1954.8 702260513 702215729 701897354 701996078 702257309 703098297 702395401 701229553 701929550 703593216 702873306
$$ packed form
1894.1G02046280k233887J67618K247467J00937J45874M12674l65143l49731j277390
1902.7G00894699O25076J946335j35574k281647j303329j1444P26928K441178M73098
1911.4G03375320j430740j081314R49173J161041O39878J559524j450806k121048N97687
1920.1G02198715J732178K182007l92380k995529j281204j73264K15607J250915L46299
1928.8G03083344o5537k7313j698685j859512J136398J548538n59387J027832P14111
1937.5G03299789l91769r59854m33273K166290r63974j660843J435394N95932j056671
1946.1G02031021q18481J016540j3428R34220J916961K43378j776428j892242O18972
1954.8G02260513m4784l18375R8724K61231Q40988p02896j165848O99997J663666p19910
$$ plain form
1964.5 702873306 701921387 701880722 700922012 700999222 701793518 702272110 701507492 700273514 699666977 699969101
1974.1 699969101 700850220 701288223 701226807 700700989 700988770 700804520 699768524 699034195 698608551 699603806
1983.7 699603806 700358047 699726715 698307495 696200027 695729828 696867676 696888046 698795471 701150818
1992.4 701150818 698919220 697516632 698458252 699357300 698860016 698301239 697555923 695185776 694744415
2001.1 694744415 695608063 695191345 694961472 695646744 695031967 695413971 696758499 695672073 696155396
2009.8 696155396 695606461 694317551 694835281 693409805 692115936 692741776 694753189 694685287 694057388
2018.5 694057388 695475235 696251907 695085373 692303009 691487198 691676407 692250214 692251282 691628799
2027.1 691628799 691422958 689997940 690453262 690307617 689602890 689374390 688153152 687858505 687304001
$$ packed form
1964.5G02873306r51919m0665r58710P7210P94296M78592p64618j233978o06537L02124
1974.1F99969101Q81119M38003o1416n25818K87781j84250j035996p34329m25644R95255
1983.7F99603806P54241o31332j419220k107468m70199J137848K0370J907425K355347
1992.4G01150818k231598j402588R41620Q99048m97284n58777p45316k370147m41361
2001.1F94744415Q63648m16718k29873O85272o14777L82004J344528j086426M83323
2009.8F96155396n48935j288910N17730j425476j293869O25840K011413o7902o27899
2018.5F94057388J417847P76672j166534k782364q15811J89209N73807J068o22483
2027.1F91628799k05841j425018M55322j45645p04727k28500j221238k94647n54504
$$ plain form
2035.8 687304001 687549057 687382736 687440643 687657471 686950226 687449722 687675171 687600632 686651840 686903610
2045.5 686903610 686981583 685563354 685437775 686024704 688104324 687574387 685110397 683889389 683529663
2054.1 683529663 684666214 684361115 684038239 684145355 682918243 681326294 681945496 684493484 683670425
2062.8 683670425 680500793 679712143 682572174 684404449 682625656 680105515 677772446 676736374
2070.5 676736374 676940689 677410202 677386322 676478653 675681534 673686295 672547455 674017639 673749084
2079.2 673749084 673370743 674773026 674905167 673690414 671563492 671204987 672863388 672310486 670193710
2087.9 670193710 670587540 672185440 671228638 670665054 672150116 674151764 674471741 672609482 671373291
2096.6 671373291 671676559 673866882 673977585 672050476 671226425 671861420 675037766 675847626 674425659
$$ packed form
2035.8F87304001K45056j66321N7907K16828p07245M99496K25449p4539r48792K51770
2045.5F86903610P7973j418229j25579N86929K079620n29937k463990j221008l59726
2054.1F83529663J136551l05099l22876J07116j227112j591949O19202K547988q23059
2062.8F83670425l169632p88650K860031J832275j778793k520141k333069j036072
2070.5F76736374K04315M69513k3880r07669p97119j995239j138840J470184k68555
2079.2F73749084l78341J402283J32141j214753k126922l58505J658401n52902k116776
2087.9F70193710L93830J597900r56802n63584J485062K001648L19977j862259j236191
2096.6F71373291L03268K190323J10703j927109q24051O34995L176346Q09860j421967
$$ plain form
2105.2 674425659 675055847 676389847 675970001 675086975 674666519 673459396 674017792 674322968 675480499
2113.9 675480499 678827438 679489975 678183441 677181320 678289032 678957291 678340225 677648697 676906586
2122.6 676906586 677735825 677948990 676810150 675364227 674557877 673487396 673600159 674614029 673315735
2131.3 673315735 672123642 671400070 673008041 674921799 674532700 674787064 674949722 675007553 674931793
2140 674931793 675190811 675258713 675887985 676716614 676947632 677524109 676456146 676362152 677016373 677333908
2149.6 677333908 677020493 676422272 677553177 678041611 678740921 678399506 677963638 678878632 678712463
2158.3 678712463 677789459 678671875 681969452 681381149 679322968 678445587 678907394 681972122 682272644
2167 682272644 681713181 681484985 680268021 679794312 680503998 680142593 679558945 679389725 677258453 677581100
$$ packed form
2105.2F74425659O30188J334000m19846q83026m20456j207123N58396L05176J157531
2113.9F75480499L346939O62537j306534j002121J107712O68259o17066o91528p42111
2122.6F76906586Q29239K13165j138840j445923q06350j070481J12763J013870j298294
2131.3F73315735j192093p23572J607971J913758l89099K54364J62658N7831p5760
2140F74931793K59018O7902O29272Q28629K31018N76477j067963r3994O54221L17535
2149.6F77333908l13415n98221J130905M88434O99310l41415m35868R14994j66169
2158.3F78712463r23004Q82416L297577n88303k058181q77381M61807L064728L00522
2167F82272644n59463k28196j216964m73709P09686l61405n83648j69220k131272L22647
$$ plain form
2176.6 677581100 678133469 678705063 678110733 674659500 675613785 676923904 677846298 678486938 678445053
2185.3 678445053 679977112 680805969 681394348 680408249 680935745 681642838 681972046 683604813 683403397
2194 683403397 684092407 684014587 683223038 684397888 686427841 686165085 685792236 687669754 686886368 687080078
2203.6 687080078 687392273 685909653 686046143 686785202 687652359 687814941 688513641 689044266 690591049
2212.3 690591049 692893295 692826004 690848541 688091354 687126923 687189255 689361420 691535873 690736618
2221 690736618 689030609 688235016 690163498 689596634 688154373 689582138 690730896 690702057 688372269
2229.7 688372269 687618484 689315338 689491806 688681870 689140472 690624466 691351089 691278305 690838470
2238.3 690838470 690756531 690413742 689782410 689325790 689337616 689893112 690314255 690407944 689978561 690829391
$$ packed form
2176.6F77581100N52369N71594n94330l451233R54285J310119R22394O40640m1885
2185.3F78445053J532059Q28857N88379r86099N27496P07093L29208J632767k01416
2194F83403397O89010p7820p91549J174850K029953k62756l72849J877518p83386J93710
2203.6F87080078L12195j482620J36490P39059Q67157J62582O98700N30625J546783
2212.3F90591049K302246o7291j977463k757187r64431O2332K172165K174453p99255
2221F90736618j706009p95593J928482n66864j442261J427765J148758k8839k329788
2229.7F88372269p53785J696854J76468q09936M58602J483994P26623p2784m39835
2238.3F90838470q1939l42789o31332m56620J1826N55496M21143R3689m29383Q50830
$$ plain form
2248 690829391 690223389 688240814 688830795 689324036 689933548 690051804 689027023 689069672 688640518 688657913
2257.6 688657913 690483322 690883865 689162292 689020767 690188446 690809174 690957565 690601730 690673447
2266.3 690673447 690447845 690085449 690078201 689268875 689552917 691508484 691754532 690483322 690156403 689809341
2275.9 689809341 689968491 692385178 693248062 691486053 691550140 691383133 690461578 691061478 690225754
2284.6 690225754 690442581 691924133 691879501 693008728 692750015 691483994 692133331 691765060 691456146
2293.3 691456146 691824112 692126541 692468719 691843262 692766876 693739243 693041077 692323532 691448135 691454086
2302.9 691454086 690628204 690986862 693549118 693707275 692051163 690687714 691785583 692677689 691340942
2311.6 691340942 689989471 689870987 691534576 691755219 692709045 695256424 696110992 693302765 691432724
$$ packed form
2248F90829391o06002j982575N89981M93241O09512J18256j024781M2649m29154J7395
2257.6F88657913J825409M00543j721573j41525J167679O20728J48391l55835P1717
2266.3F90673447k25602l62396p248q09326K84042J955567K46048j271210l26919l47062
2275.9F89809341J59150K416687Q62884j762009O4087j67007r21555N99900q35724
2284.6F90225754K16827J481552m4632J129227k58713j266021O49337l68271l08914
2293.3F91456146L67966L02429L42178o25457R23614R72367o98166p17545q75397N951
2302.9F91454086q25882L58658K562256J58157j656112j363449J097869Q92106j336747
2311.6F91340942j351471j18484J663589K20643R53826K547379Q54568k808227j870041
$$ plain form
2320.3 691432724 694122849 692777786 691363449 691696320 689283371 687366867 685297775 685328522 685934296
2329 685934296 686709671 688683319 690973206 692529526 691545029 692033615 694372559 694138184 689263992
2337.7 689263992 688573303 689283066 685230331 688088989 694697189 696314545 694578934 696511688 699670258
2346.3 699670258 696968918 694881210 696651764 698743820 698065262 693667374 689996643 694894638
2354.1 694894638 699495468 697312775 697652817 696773911 700004501 700926285 690904160 686641083 692973099
2362.7 692973099 700466690 696985550 693073883 698941269 701500702 700576324 700794678 699538116 698341751
2371.4 698341751 697600021 697989807 697327728 694808273 696939392 700218124 702005539 704338455 704095078
2380.1 704095078 702141876 701113815 701736069 701733627 701369858 701540298 701180725 701888046 702104416 701397858
$$ packed form
2320.3F91432724K690125j345063j414337L32871k412949j916504k069092L0747O05774
2329F85934296P75375J973648K289887J556320r84497M88586K338944k34375m874192
2337.7F89263992o90689P09763m052735K858658O608200J617356j735611J932754L158570
2346.3F99670258k701340k087708J770554K092056o78558m397888l670731M897995
2354.1F94894638M600830k182693L40042q78906L230590R21784j0022125m263077O332016
2362.7F92973099P493591l481140l911667N867386K559433r24378K18354j256562j196365
2371.4F98341751p41730L89786o62079k519455K131119L278732J787415K332916k43377
2380.1G04095078j953202j028061O22254k442l63769J70440l59573P07321K16370p06558
$$ plain form
2389.7 701397858 700095139 699410706 700831985 701465607 700244293 698509293 699292831 701122665 701678009
2398.4 701678009 701735077 702059250 703216095 702546463 701777191 701690750 700470657 699974365 700287018 700201569
2408.1 700201569 700279999 700785522 699758072 698890305 698951492 699629593 700538101 699331818 698438568 698147354
2417.7 698147354 697837906 696607819 694673233 695881195 699255371 701011505 699282379 697793808
2425.4 697793808 698297119 699740753 700533981 698205032 696052551 695876923 696184387 695462112 694936600
2434.1 694936600 695574417 695949020 696036682 695318985 694612656 693789749 693668442 694256821 695100479 696093216
2443.7 696093216 694855957 693460846 692903824 693064651 692865448 692503586 693613510 692859955 691222610
2452.4 691222610 690724487 690757599 690762100 691515121 692293701 691541138 691206665 689604950 688268433 688639221
$$ packed form
2389.7G01397858j302719o84433J421279O33622j221314j735000P83538J829834N55344
2398.4G01678009N7068L24173J156845o69632p69272q6441j220093m96292L12653q5449
2408.1G00201569P8430N05523j027450q67767O1187O78101R08508j206283q93250k91214
2417.7F98147354l09448j230087j934586J207962L374176J756134j729126j488571
2425.4F97793808N03311J443634P93228k328949k152481j75628L07464p22275n25512
2434.1F94936600O37817L74603Q7662p17697p06329q22907j21307N88379Q43658R92737
2443.7F96093216j237259j395111n57022J60827j99203l61862J109924p53555j637345
2452.4F91222610m98123L3112M501P53021P78580p52563l34473j601715j336517L70788
$$ plain form
2462.1 688639221 688470001 688901520 688721542 687519302 687435074 687728729 686767654 686665268 686400757 684859924
2471.7 684859924 684743576 685017776 685494156 685933533 685826340 684861374 683967743 684033356 683942413 685288239
2481.3 685288239 685510483 683791275 682634659 681970825 682395401 683256760 682709579 680267563 680038910
2490 680038910 681772308 682226028 681078415 679488602 680821381 681602783 679741974 678662109 678386841
2498.7 678386841 677137985 675953751 676918716 677584686 677443924 676382904 675358505 675951920 675203552
2507.4 675203552 675344543 676463852 675378265 675243835 676134872 675731354 675153961 675227661 675625229
2516.1 675625229 674844513 674085617 674871597 674966660 674465866 672541122 670750809 671589737 671819534
2524.7 671819534 671526031 670882645 670402908 671892166 673138733 672544785 669951477 667510605 668349609
$$ packed form
2462.1F88639221j69220M31519j79978j202240q4228K93655r61075j02386k64511j540833
2471.7F84859924j16348K74200M76380M39377j07193r64966q93631O5613r0943J345826
2481.3F85288239K22244j719208j156616o63834M24576Q61359n47181k442016k28653
2490F80038910J733398M53720j147613j589813J332779P81402j860809j079865k75268
2498.7F78386841j248856j184234R64965O65970j40762j061020j024399N93415p48368
2507.4F75203552J40991J119309j085587j34430Q91037m03518n77393P3700L97568
2516.1F75625229p80716p58896P85980R5063n00794j924744j790313Q38928K29797
2524.7F71819534k93503o43386m79737J489258J246567n93948k593308k440872Q39004
$$ plain form
2533.4 668349609 671003342 671961060 671330795 670083923 670144958 671042404 669177017 667414932 667077408
2542.1 667077408 667391663 668977585 669787979 669507294 668323364 667712402 668879623 669506531 667834244
2550.8 667834244 665883865 666666107 668724136 669020462 668230591 668315353 668796921 668426437 666813812
2559.5 666813812 666666489 667568741 666400986 664840698 663534393 663738174 664966507 666037750 666760406
2568.1 666760406 665230789 663621674 662999878 664299774 665654068 664230652 662247543 660940170
2575.9 660940170 661522064 662007599 662187729 662590332 661909485 662051010 663041840 662403030 659186325
2584.5 659186325 657647171 658116074 658904190 660755615 661837311 662031708 661208038 660431824 659737701
2593.2 659737701 659502716 659406433 657692947 657109299 656748505 655955658 655667801 655439682 654756165 653932877
$$ packed form
2533.4F68349609K653733R57718o30265j246872O1035Q97446j865387j762085l37524
2542.1F67077408L14255J585922Q10394k80685j183930o10962J167221O26908j672287
2550.8F67834244j950379P82242K058029K96326p89871Q4762M81568l70484j612625
2559.5F66813812j47323R02252j167755j560288j306305K03781J228333J071243P22656
2568.1F66760406j529617j609115o21796J299896J354294j423416j983109j307373
2575.9F60940170N81894M85535J80130M02603o80847J41525R90830o38810l216705
2584.5F59186325j539154M68903P88116J851425J081696J94397q23670p76214o94123
2593.2F59737701k34985r6283j713486n83648l60794p92847k87857k28119o83517q23288
$$ plain form
2602.9 653932877 654623413 655119553 655451279 654461670 652520370 652632141 653065186 652634811 651033020
2611.5 651033020 650426102 652005310 652461624 649973373 648201370 649378967 650557709 650970230 649825363
2620.2 649825363 648331757 647188187 646493988 647604065 646615067 645169601 646448669 646735153 645168686
2628.9 645168686 644004745 643878937 644100723 643926773 643590546 643551331 642510300 641844330 642113266
2637.6 642113266 641877747 642134781 641644669 640490494 639590073 638680305 638799973 639534874 638895874
2646.3 638895874 637194748 637314262 637478828 636320953 636134987 635332527 633755379 633982201 634769135
2654.9 634769135 635042343 635617714 635788155 635555496 633560143 631139069 631685104 631984558 631650620
2663.6 631650620 632162056 631581345 629953003 627964134 627846832 630032730 630102196 627787056 626605072
$$ packed form
2602.9F53932877O90536M96140L31726r89609j941300J11771M33045m30375j601791
2611.5F51033020o06918J579208M56314k488251j772003J177597J178742M12521j144867
2620.2F49825363j493606j143570o94199J110077r88998j445466J279068K86484j566467
2628.9F45168686j163941j25808K21786j73950l36227l9215j041031o65970K68936
2637.6F42113266k35519K57034m90112j154175r00421r09768J19668P34901o39000
2646.3F38895874j701126J19514J64566j157875j85966q02460j577148K26822P86934
2654.9F34769135K73208N75371J70441k32659j995353k421074N46035K99454l33938
2663.6F31650620N11436n80711j628342j988869j17302K185898O9466k315140j181984
$$ plain form
2672.3 626605072 626917763 627786026 626574097 624573059 626033134 627343864 627036057 627141609 625847588
2681 625847588 623303146 622237778 623054581 622843857 622516174 623336983 621813774 619503822 618965149
2689.6 618965149 618122902 618259735 620142593 620371857 618938370 618638649 619763069 619802017 618257942
2698.3 618257942 617215614 616851425 616946030 617615242 616628456 614160118 613975258 614465256 614398003 615308609
2708 615308609 614648590 613247604 612929573 612170334 611096916 610498466 609361534 608237572 608445892
2716.6 608445892 608706932 609877434 609737968 607289200 606401405 606835022 608410492 608821754 608108406
2725.3 608108406 607328415 604938087 604303856 604421692 603570480 603221169 603205338 604085236 604393921 602196312
2735 602196312 599308586 599776726 602193680 602943993 602068443 599873276 598610115 598871574 598394585
$$ packed form
2672.3F26605072L12691Q68263j211929k001038J460075J310730l07807J05552j294021
2681F25847588k544442j065368Q16803k10724l27683Q20809j523209k309952n38673
2689.6F18965149q42247J36833J882858K29264j433487k99721J124420L8948j544075
2698.3F18257942j042328l64189R4605O69212r86786k468338j84860M89998o7253R10606
2708F15308609o60019j400986l18031p59239j073418n98450j136932j123962K08320
2716.6F08445892K61040J170502j39466k448768q87795M33617J575470M11262p13348
2725.3F08108406p79991k390328o34231J17836q51212l49311j5831Q79898L08685k197609
2735F02196312k887726M68140K416954P50313q75550k195167j263161K61459m76989
$$ plain form
2743.7 598394585 598149872 599200974 599910469 598845787 596544838 595841560 596115189 595288582 595337410
2752.3 595337410 595277061 594472961 594328003 593127480 591827698 592138100 592481537 592581558 592362785
2761 592362785 591369896 591103554 590337601 588841782 589258957 589710922 587936363 586096649 586741028
2769.7 586741028 587382965 586206398 584845963 583855896 583670959 583648682 583543549 582130318 580416031
2778.4 580416031 580639343 580144577 578338547 577136841 577348595 577531319 577272949 576586113 575589218
2787 575589218 575983658 575586281 574706917 574487228 573904686 572857437 571269455 570294762 569024048
2795.7 569024048 567739296 566972847 566610832 565918121 564805107 565409546 564779587 562357483 560703545
2804.4 560703545 561113625 562020874 560916710 560857048 560199966 557146721 554232140 553082085 554090958
$$ packed form
2743.7E98394585k44713J051102P09495j064682k300949p03278K73629q26607M8828
2752.3E95337410o0349q04100j44958j200523j299782L10402L43437J00021k18773
2761E92362785r92889k66342p65953j495819M17175M51965j774559j839714O44379
2769.7E86741028O41937j176567j360435r90067j84937k2277j05133j413231j714287
2778.4E80416031K23312m94766j806030j201706K11754J82724k58370o86836r96895
2787E75589218L94440l97377q79364k19689n82542j047249j587982r74693j270714
2795.7E69024048j284752p66449l62015o92711j113014O04439o29959k422104j653938
2804.4E60703545M10080R07249j104164n9662o57082l053245k914581j150055J008873
$$ plain form
2813.1 554090958 554002075 553497200 554183273 553694077 551843185 550481720 549620323 547430534 544886398
2821.8 544886398 543919525 543241196 541976852 541208916 540716400 539511604 536971436 534718933 533767700
2830.4 533767700 533395424 534075851 533532410 532151299 531063766 529341583 527826996 525500031 524033127
2839.1 524033127 523093834 520295906 515523453 510642509 509574127 508195190 504433517 501209831
2846.8 501209831 497380180 493737450 490913849 488669128 487136307 486245117 485445633 484442177 484554253
2855.5 484554253 484434166 483052597 482646484 482499924 481081161 480930977 481393127 480247803 478702965
2864.2 478702965 477217598 476343269 475928802 474250221 471603661 470909081 470740013 468721008 466746216
2872.9 466746216 464445457 462244644 460536270 460681725 462047615 460394402 459464111 459564323 458092422
$$ packed form
2813.1E54090958q8883n04875O86073m89196j850892j361465q61397k189789k544136
2821.8E44886398r66873o78329j264344p67936m92516j204796k540168k252503r51233
2830.4E33767700l72276O80427n43441j381111j087533j722183j514587k326965j466904
2839.1E24033127r39293k797928m772453m880944j068382j378937l761673l223686
2846.8E01209831l829651l642730k823601k244721j532821q91190p99484j003456J12076
2855.5D84554253j20087j381569m06113j46560j418763j50184M62150j145324j544838
2864.2D78702965j485367q74329m14467j678581k646560o94580j69068k019005j974792
2872.9D66746216k300759k200813j708374J45455J365890j653213r30291J00212j471901
$$ plain form
2881.6 458092422 456951447 456137772 456523705 455971642 452724075 449722672 448378830 447781525 447539978
2890.2 447539978 447547760 446370392 444176292 442850266 443118896 441233139 437900467 437595482 437543373
2898.9 437543373 437339249 436595764 434451637 432603645 430955963 431146927 431144867 430778847 430795631 429195747
2908.6 429195747 427928085 426038628 424015808 422928314 421518936 420520782 418666573 416876640
2916.3 416876640 416042175 414292107 412517204 411678162 410073547 408337860 407968407 407146339 406811333
2925 406811333 407769623 407825775 407150421 407940178 409573898 408518448 407915688 410601120 411469116 410689659
2934.6 410689659 411048508 410419769 410743904 412865868 413149719 414017372 414897118 413992882 415177116
2943.3 415177116 417528191 418870964 417725258 417219315 419768028 419478226 418247375 417770729 415901489
$$ packed form
2881.6D58092422j140975q13675L85933n52063l247567l001403j343842n97305k41547
2890.2D47539978P782j177368k194100j326026K68630j885757l332672l04985n2109
2898.9D37543373k04124p43485k144127j847992j647682J90964k060l66020J6784j599884
2908.6D29195747j267662j889457k022820j087494j409378r98154j854209j789933
2916.3D16876640q34465j750068j774903q39042j604615j735687l69453q22068l35006
2925D06811333R58290N6152o75354P89757J633720j055450o02760K685432Q67996p79457
2934.6D10689659L58849o28739L24135K121964K83851Q67653Q79746r04236J184234
2943.3D15177116K351075J342773j145706n05943K548713k89802j230851m76646j869240
$$ plain form
2952 415901489 415757103 416137466 414874916 414039993 413789101 413469543 415181351 416005821 414432373
2960.6 414432373 414547386 414218445 414819641 417639809 418885460 419595985 420451622 421457100 422226830
2969.3 422226830 423836632 426639786 427308426 426934013 428493805 431673584 432938538 433273048 435641518
2978 435641518 436996727 437935486 439806480 440624886 441393967 443731232 446001053 446005020 446524124 448694725
2987.6 448694725 449003143 448170624 449195976 451619377 453171082 454069481 455767670 457190361 457776718
2996.3 457776718 458709755 458983307 457702484 457408600 458613319 459485970 460161667 460378571 458858986
3005 458858986 456462975 456707954 458970604 459309120 458503609 458142242 458545494 459559669 460008011
3013.7 460008011 459004784 456391220 454957428 455364532 454796677 453725548 454656258 456627884 456336632
$$ packed form
2952D15901489j44386L80363j262550q34923k50892l19558J711808Q24470j573448
2960.6D14432373J15013l28941O01196K820168J245651P10525Q55637J005478P69730
2969.3D22226830J609802K803154O68640l74413J559792L179779J264954L34510K368470
2978D35641518J355209R38759J870994Q18406P69081K337265K269821L967N19104K170601
2987.6D48694725L08418q32519J025352K423401J551705Q98399J698189J422691N86357
2996.3D57776718R33037K73552j280823k93884J204719Q72651O75697K16904j519585
3005D58858986k396011K44979K262650L38516q05511l61367M03252J014175M48342
3013.7D60008011j003227k613564j433792M07104n67855j071129R30710J971626k91252
$$ plain form
3022.4 456336632 454326248 453047943 452180061 451243553 450277252 449040871 449425621 450983391 450072784
3031 450072784 448180733 447846184 447743149 446474113 445075531 444524269 443724174 443154984 442372360
3039.7 442372360 440892906 439895782 439087029 438586121 438459549 437771645 435721359 433557053 433726120
3048.4 433726120 435398483 434245110 431711807 431551018 430559654 429762535 429830284 427718315 426019058
3057.1 426019058 425194321 424864960 424843102 424262238 423822594 423205833 421558647 419298897 418911171
3065.7 418911171 418753815 418385811 417964249 416295853 416341972 415211411 413230667 414191093 414588318
3074.4 414588318 413584366 411969910 410919037 410639229 410399666 410818138 410332985 409213219 408260918
3083.1 408260918 407375832 406257401 404921646 404813118 404403343 403148499 402275581 401151047 400296021
$$ packed form
3022.4D56336632k010384j278305q67882r36508r66301j236381L84750J557770r10607
3031D50072784j892051l34549j03035j269036j398582n51262q00095n69190p82624
3039.7D42372360j479454r97124q08753n00908j26572o87904k050286k164306J69067
3048.4D33726120J672363j153373k533303j60789r91364p97119O7749k111969j699257
3057.1D26019058q24737l29361k1858n80864m39644o16761j647186k259750l87726
3065.7D18911171j57356l68004m21562j668396M6119j130561j980744R60426L97225
3074.4D14588318j003952j614456j050873k79808k39563M18472m85153j119766r52301
3083.1D08260918q85086j118431j335755j08528m09775j254844q72918j124534q55026
$$ plain form
3091.8 400296021 399627304 399078979 398728180 396916695 395004005 395412178 396232986 395229607 394316902
3100.5 394316902 394212456 393064995 392366791 392198677 391298294 390089531 388549461 387360954 386011353
3109.1 386011353 384305573 383225403 383280945 383330193 381905403 381127586 380017357 377286491 376124916
3117.8 376124916 376555252 376671028 375675774 374559479 373616791 371988907 370988235 370250511 368418427
3126.5 368418427 367045822 366372643 365398521 364921799 364042664 362728271 361423378 359859200 360347443
3135.2 360347443 360359077 358625908 358106499 356988335 355990181 356185455 355518532 353772240 351626358
3143.9 351626358 350613174 349705467 347902451 347107697 346722527 345304451 343242569 341986465 341600914
3152.5 341600914 340360565 338676071 337206001 337014656 337593575 335461693 333087578 331661301 329589844
$$ packed form
3091.8D00296021o68717n48325l50799j811485j912690M08173Q20808j003379r12705
3100.5C94316902j04446j147461o98204j68114r00383j208763j540070j188507j349601
3109.1C86011353j705780j080170N5542M9248j424790p77817j110229k730866j161575
3117.8C76124916M30336J15776r95254j116295r42688j627884j000672p37724j832084
3126.5C68418427j372605o73179r74122m76722q79135j314393j304893j564178M88243
3135.2C60347443J1634j733169n19409j118164r98154J95274o66923j746292k145882
3143.9C51626358j013184r07707j803016p94754l85170j418076k061882j256104l85551
3152.5C41600914j240349j684494j470070j91345N78919k131882k374115j426277k071457
$$ plain form
3161.2 329589844 329957848 331181870 330795860 329440613 327007561 325625153 325563164 324406013 322574501
3169.9 322574501 321176109 319207611 318039322 318112659 317438831 316055832 314163151 313232574 312651596
3178.6 312651596 312174149 312249603 311197433 310830669 309697647 306799488 304950008 304728336 304205322
3187.3 304205322 302022076 301932869 302088051 301108379 301195488 299803753 298114109 295676594 293814201
3195.9 293814201 294301662 293660717 292821712 292056580 290485458 288894405 288551674 287874069 286091099
3204.6 286091099 285489693 284558983 285907993 287272167 283240891 280379982 280976601 281677074 281303596
3213.3 281303596 280036068 279250164 278274002 277125473 275994816 274507446 272842827 272054005 273028698
3222 273028698 273083305 271430550 271324844 271703548 270146275 267816505 266208172 266448517 266196613
$$ packed form
3161.2C29589844L68004J224022l86010j355247k433052j382408o1989j157151j831512
3169.9C22574501j398392j968498j168289P3337o73828j382999j892681r30577n80978
3178.6C12651596m77447P5454j052170l66764j133022k898159j849480k21672n23014
3187.3C04205322k183246q9207J55182r79672Q7109j391735j689644k437515j862393
3195.9B93814201M87461o40945q39005p65132j571122j591053l42731o77605j782970
3204.6B86091099o01406r30710J349010J364174m031276k860909N96619P00473l73478
3213.3B81303596j267528p85904r76162j148529j130657j487370j664619p88822R74693
3222B73028698N4607j652755j05706L78704j557273k329770j608333K40345k51904
$$ plain form
3230.7 266196613 264790497 265174160 265887585 265809803 264659042 262541695 261409359 260765038 259574375
3239.3 259574375 258616009 258833580 257496700 255509014 256535263 256546993 254858475 254908009 254892540
3248 254892540 254659367 255085754 252965183 250455456 251805992 251879826 249099846 247582283 247584343 247753124
3257.7 247753124 246373062 245190907 245266247 245167198 244697571 243458042 242674656 242294636 240294743
3266.3 240294743 238671379 240091915 241468582 240701637 240123806 239145851 237675686 237636490 237829189
3275 237829189 236965618 234926682 233219776 234232578 235746632 235259151 233673134 231815643 231410732
3283.7 231410732 231586418 231297874 231335258 231160774 232015953 232657814 231984177 231217346 229330902 227156734
3293.3 227156734 226579456 227303905 227605095 227788334 228000622 226787128 225092087 224772758 225610638
$$ packed form
3230.7B66196613j406116L83663P13425p7782j150761k117347j132336o44321j190663
3239.3B59574375r58366K17571j336880j987686J026249J1730j688518M9534j5469
3248B54892540k33173M26387k120571k509727J350536P3834k779980j517563K060J68781
3257.7B47753124j380062j182155P5340r9049m69627j239529p83386l80020j999893
3266.3B40294743j623364J420536J376667p66945n77831r77955j470165l9196J92699
3275B37829189q63571k038936j706906J012802J514054m87481j586017j857491m04911
3283.7B31410732J75686k88544L7384j74484Q55179O41861o73637p66831j886444k174168
3293.3B27156734n77278P24449L01190J83239K12288j213494j695041l19329Q37880
$$ plain form
3302 225610638 224619827 223514881 223950157 223768005 224339924 223844166 222005329 221439152 220904999 220674934
3311.7 220674934 220201283 218339062 216735992 217649956 219070435 217516670 215541630 214950466 214659519
3320.3 214659519 215200653 215232506 213909359 213429127 212955475 211912651 212366524 213181095 212939034
3329 212939034 211970901 210239563 208329201 208482437 209800606 209146061 208088207 207674370 207167549
3337.7 207167549 205734615 203872185 204166718 204106560 202764683 203291206 203530083 201325970 200507889
3346.4 200507889 201920700 201129208 199340248 199538269 200471439 201161919 200410480 198231010 196869202
3355.1 196869202 196130199 194671154 194369354 195316410 195384922 195256481 195422611 195027008 193384590
3363.7 193384590 192032604 191927700 190872040 190044441 189971523 188623657 187825527 188626232 188448792
$$ packed form
3302B25610638r90811j104946M35276j82152N71919m95758j838837n66177n34153k30065
3311.7B20674934m73651j862221j603070R13964J420479j553765j975040n91164k90947
3320.3B14659519N41134L1853j323147m80232m73652j042824M53873Q14571k42061
3329B12939034r68133j731338j910362J53236J318169o54545j057854m13837n06821
3337.7B07167549j432934j862430K94533o0158j341877N26523K38877k204113q18081
3346.4B00507889J412811p91492j788960J98021R33170O90480p51439k179470j361808
3355.1A96869202p39003j459045l01800R47056O8512j28441J66130l95603j642418
3363.7A93384590j351986j04904j055660q27599p2918j347866p98130Q00705j77440
$$ plain form
3372.4 188448792 186260624 184881554 185285378 185597878 186459446 186259441 183693752 183267574 184620571
3381.1 184620571 184033604 182999763 182996292 183296185 183434715 182817459 182016029 181807880 181080608 180671005
3390.7 180671005 181925659 182438374 181699104 182410088 182934284 181202965 180551243 181170368 180347862
3399.4 180347862 179571514 178859577 178139000 178938427 179005356 177802753 177373848 177198887 177499218 177705479
3409.1 177705479 176970596 176980495 177312431 177571735 177681637 176953392 176251450 176229229 177418194 178154621
3418.7 178154621 177514095 177044449 176609707 175861893 175105610 175465145 176728649 176971474 175974712
3427.4 175974712 176161442 177721157 177183247 176373100 178336239 180564213 180445633 178656330 178194046
3436.1 178194046 179237919 180136089 180613575 180301304 179696827 179144764 179229546 180793152 180725899 179225845
$$ packed form
3372.4A88448792k188168j379070M03824L12500Q61568k00005k565689m26178J352997
3381.1A84620571n86967j033841l471K99893J38530o17256q01430k08149p27272m09603
3390.7A80671005J254654N12715p39270P10984N24196j731319o51722O19125q22506
3399.4A80347862p76348p11937p20577P99427O6929j202603m28905j74961L00331K06261
3409.1A77705479p34883R899L31936K59304J09902p28245p01942k2221J188965P36427
3418.7A78154621o40526m69646m34742p47814p56283L59535J263504K42825r96762
3427.4A75974712J86730J559715n37910q10147J963139K227974j18580j789303m62284
3436.1A78194046J043873Q98170M77486l12271o04477n52063Q4782J563606o7253j500054
$$ plain form
3445.7 179225845 179795341 180020657 180250912 181832485 182034836 182172184 183276920 183891792 184469452
3454.4 184469452 185309849 185003757 184906769 186009922 186250782 186613445 186690235 186410217 187052441 187510185
3464 187510185 187902603 188010464 188536491 189671364 190802441 191036053 190611057 191701984 192157669
3472.7 192157669 191584854 192167931 194771976 196744175 195964413 196285381 197551270 198625031 198841381
3481.4 198841381 198155899 199369717 199864941 199666176 199421501 199824944 202056637 202786751 204068928
3490.1 204068928 205883141 206077900 205501251 203833885 204836349 208493710 210469933 209598370 207944298
3498.7 207944298 208442154 209489822 211663189 215226326 216153183 215664387 215501862 215277939 214901295
3507.4 214901295 215093517 216266747 217686157 218909988 220026340 221494694 221836395 221759090 222066307
$$ packed form
3445.7A79225845N69496K25316K30255J581573K02351J37348J104736O14872N77660
3454.4A84469452Q40397l06092r6988J103153K40860L62663P6790k80018O42224M57744
3464A87510185L92418J07861N26027J134873J131077K33612m24996J090927M55685
3472.7A92157669n72815N83077K604045J972199p79762L20968J265889J073761K16350
3481.4A98841381o85482J213818M95224j98765k44675M03443K231693P30114J282177
3490.1B04068928J814213J94759n76649j667366J002464L657361J976223q71563j654072
3498.7B07944298M97856J047668K173367L563137R26857m88796j62525k23923l76644
3507.4B14901295J92222J173230J419410J223831J116352J468354L41701p7305L07217
$$ plain form
3516.1 222066307 222417011 223324566 223634014 225509167 228108807 229170055 229151382 227972603 229530544
3524.8 229530544 233389378 234827156 234035912 234819031 235169601 235700474 237113018 235909729 236526699
3533.5 236526699 238711567 240133381 240394287 239973316 243164253 245135651 245776730 246702957 246509895
3542.1 246509895 248323517 250681534 252117443 252937431 253888531 254922085 257105293 258468742 257607098
3550.8 257607098 258996620 260381165 261154346 261879597 262815437 265359898 267044373 268511524 269721680
3559.5 269721680 271052227 271988640 272549648 273490257 276179905 281004677 281138897 279978943 281915817
3568.2 281915817 283447514 285005684 286464615 289454231 290983696 292562447 294736500 296804390
3575.9 296804390 298305302 298013096 300151672 301549397 303645515 306310616 307059631 308552208 310148029
$$ packed form
3516.1B22066307L50704R07555L09448J875153K599640J061248j8673j178779J557941
3524.8B29530544L858834J437778p91244P83119L50570N30873J412544j203289O16970
3533.5B36526699K184868J421814K60906m20971L190937J971398O41079R26227j93062
3542.1B46509895J813622K358017J435909Q19988R51100J033554K183208J363449q61644
3550.8B57607098J389522J384545P73181P25251R35840K544461J684475J467151J210156
3559.5B69721680J330547R36413N61008R40609K689648M824772J34220j159954J936874
3568.2B81915817J531697J558170J458931K989616J529465J578751K174053K067890
3575.9B96804390J500912k92206K138576J397725K096118K665101P49015J492577J595821
$$ plain form
3584.6 310148029 315173798 319996529 320978394 321147041 318578968 320641632 324728203 329191742 331567764
3593.2 331567764 331767540 333442497 333598366 337051277 341651497 344008751 346522827 347435684 348780899
3601.9 348780899 352270966 355387764 356798134 359292488 363901825 366197014 367927971 367370949
3609.6 367370949 368383484 374682884 376773643 376587906 382288246 385541878 388584785 392649422
3617.4 392649422 395435028 399223557 400161896 400226822 403247528 408074226 412672958 415346413 418193512
3626 418193512 422282791 425292969 422063255 421589737 430334091 437071724 441300659 443518600 445865364
3634.7 445865364 450781174 455993233 460376587 462100296 463748817 467782364 471012383 473078156
3642.4 473078156 476945610 481598625 485482292 491621628 494662285 492518463 497808762 503106041
$$ packed form
3584.6C10148029N025769M822731R81865J68647k568073K062664M086571M463539K376022
3593.2C31567764J99776J674957J55869L452911M600220K357254K514076R12857J345215
3601.9C48780899L490067L116798J410370K494354M609337K295189J730957n57022
3609.6C67370949J012535O299400K090759j85737N700340L253632L042907M064637
3617.4C92649422K785606L788529R38339O4926L020706M826698M598732K673455K847099
3626D18193512M089279L010178l229714m73518Q744354O737633M228935K217941K346764
3634.7D45865364M915810N212059M383354J723709J648521M033547L230019K065773
3642.4D73078156L867454M653015L883667O139336L040657k143822N290299N297279
$$ plain form
3650.1 503106041 503381538 503332367 509479980 515431328 520176773 526406136 523466492 526006584 529123039
3658.8 529123039 527518692 530697174 536328773 541383934 543347015 545621986 548947983 552306175
3666.5 552306175 557529106 557806740 559615555 563292503 557393875 561640167 569629936 577152672
3674.3 577152672 580532227 566293144 564563789 572835732 580981369 582178001 582875214 584448128
3682 584448128 585240669 588135719 590874214 591787529 594774933 599526215 592330856 589118004 597016296
3690.6 597016296 595697594 596516457 601744308 602643967 604649544 604457054 602729950 603705711 604453011
3699.3 604453011 608372765 612463455 609726562 610463448 614899330 615374298 616128693 617647705 619323196
3708 619323196 621953278 615710106 619848900 623678894 611516380 618278236 623876114 624291687 625379829
$$ packed form
3650.1E03106041K75497m9171O147613N951348M745445O229363k939644K540092L116455
3658.8E29123039j604347L178482N631599N055161J963081K274971L325997L358192
3666.5E52306175N222931K77634J808815L676948n898628M246292P989769P522736
3674.3E77152672L379555j4239083j729355Q271943Q145637J196632O97213J572914
3682E84448128P92541K895050K738495R13315K987404M751282p195359l212852P898292
3690.6E97016296j318702Q18863N227851Q99659K005577j92490j727104R75761P47300
3699.3F04453011L919754M090690k736893P36886M435882M74968P54395J519012J675491
3708F19323196K630082o243172M138794L829994j2162514O761856N597878M15573J088142
$$ plain form
3716.7 625379829 626682091 628433723 625944328 627110176 634180641 632148705 626616211 630328407
3724.4 630328407 632699242 631393852 625106888 625628891 632305298 636580696 644197617 640562668
3732.1 640562668 630005569 638057251 641843796 634172287 629773178 632825508 636262856 637387962
3739.8 637387962 638441887 636241150 640414200 650393219 636592216 621754913 633057022 639438057
3747.5 639438057 646272354 648606186 639974785 648982010 642291107 632052879 636398392 639423981
3755.3 639423981 644554520 642357330 644496994 650767288 643534546 640029068 642393265 644631653
3763 644631653 647179413 650322266 646202927 640771255 646998901 654511337 652411194 642341690
3770.7 642341690 644084854 647536163 647696609 647195511 646532516 648123779 649028931 651270523 650801315
$$ packed form
3716.7F25379829J302262J751632k489395J165848P070465k031936n532494L712196
3724.4F30328407K370835j305390o286964N22003O676407M275398P616921l634949
3732.1F40562668j0557099Q051682L786545p671509m399109L052330L437348J125106
3739.8F37387962J053925k200737M173050R979019j3801003j4837303J1302109O381035
3747.5F39438057O834297K333832q631401R007225o690903j0238228M345513L025589
3755.3F39423981N130539k197190K139664O270294p232742l505478K364197K238388
3763F44631653K547760L142853m119339n431672O227646P512436k100143j0069504
3770.7F42341690J743164L451309J60446n01098o62995J591263R05152K241592m69208
$$ plain form
3779.4 650801315 644292679 647440033 650588074 651302185 652315292 649633865 648453064 648302994 648944244
3788 648944244 650774460 652413635 654125900 652546234 650443573 649609299 651763458 655683441 651702576
3796.7 651702576 649369965 652075195 655752487 660625839 652395477 643789291 648125229 651181183
3804.4 651181183 655036850 658789368 648244553 644353485 651823654 655910187 655520935 654045410
3812.2 654045410 654169769 655068970 657462921 656540909 644179764 646612167 652695236 659191132 664032059
3820.8 664032059 645388641 643160782 649695892 652486496 653761520 654420624 652094116 651782150
3828.6 651782150 654597855 659937057 662335281 652444839 653193893 661090393 658883209 658718567 666823654
3837.2 666823654 655699387 646699295 655751953 651837769 650835876 656197433 653202057 652563477
$$ packed form
3779.4F50801315o508636L147354L148041P14111J013107k681427j180801j50070O41250
3788F48944244J830216J639175J712265j579666k102661q34274K154159L919983l980865
3796.7F51702576k332611K705230L677292M873352q230362q606186M335938L055954
3804.4F51181183L855667L752518j0544815l891068P470169M086533l89252j475525
3812.2F54045410J24359Q99201K393951r22012j2361145K432403O083069O495896M840927
3820.8F64032059j8643418k227859O535110K790604J275024O59104k326508l11966
3828.6F51782150K815705N339202K398224r890442P49054P896500k207184j64642Q105087
3837.2F66823654j1124267r000092R052658l914184j001893N361557k995376o38580
$$ plain form
3844.9 652563477 655664215 656390762 654394684 654273987 654612961 658491898 664769363 656855240 658974228
3853.6 658974228 646846313 646052704 656985321 655190125 652193985 653571472 655669479 657451859
3861.3 657451859 650618210 650951767 657160721 649563217 645933533 653246002 656870804 656821747 647263031
3870 647263031 643072433 649351425 657554932 664048080 654733582 653715439 656822662 654937592 655560455
3878.7 655560455 657632065 653805771 648918152 653434525 654278488 657880478 663832016 646931915
3886.4 646931915 646633453 651793518 654118500 658237152 657279205 652361984 651818466 654756393 653904266
3895.1 653904266 653672028 654298782 655204849 655320358 646163025 651326981 655826797 653461914 656899872
3903.8 656899872 651583328 650231552 651994476 653283310 655111313 653951721 652673111 651075058
$$ packed form
3844.9F52563477L100738P26547j996078j20697L38974L878937O277465p914123K118988
3853.6F58974228j2127915p93609J0932617j795196k996140J377487K098007J782380
3861.3F57451859o833649L33557O208954p597504l629684P312469L624802m9057r558716
3870F47263031m190598O278992Q203507O493148r314498j018143L107223j885070O22863
3878.7F55560455K071610l826294m887619M516373Q43963L601990N951538j6900101
3886.4F46931915k98462N160065K324982M118652r57947m917221n43518K937927q52127
3895.1F53904266k32238O26754R06067J15509r157333N163956M499816k364883L437958
3903.8F56899872n316544j351776J762924J288834J828003j159592j278610j598053
$$ plain form
3911.5 651075058 651488800 652642365 652891006 653908844 654800949 651030502 646180496 649333572 650651703
3920.2 650651703 647651596 649458542 651866989 653683014 653400955 652244797 654457245 654871902 651212921
3928.8 651212921 647198639 648753052 652715988 652324524 651325378 652294693 652351303 650787354 649751053
3937.5 649751053 649438095 649320450 650593719 653481140 655832748 652053757 649669342 650882187 651269150
3946.2 651269150 650673828 647576752 649255447 650658112 647922821 649494324 650583801 650373001 650908813
3954.9 650908813 651074753 649409103 647923203 648434906 647652740 649369354 651756439 650564728 649066010
3963.6 649066010 648409195 647804871 647049408 647675781 650379105 653165894 651503448 649426117 649517059
3972.2 649517059 649667053 651336594 651023941 650454025 651392670 650326538 647498703 646983185 649070358
$$ packed form
3911.5F51075058M13742J153565K48641J017838Q92105l770447m850006L153076J318131
3920.2F50651703l000107J806946K408447J816025k82059j156158K212448M14657l658981
3928.8F51212921m014282J554413L962936l91464r99146R69315N6610j563949j036301
3937.5F49751053l12958j17645J273269K887421K351608l778991k384415J212845L86963
3946.2F51269150n95322l097076J678695J402665k735291J571503J089477k10800N35812
3954.9F50908813J65940j665650j485900N11703p82166J716614K387085j191711j498718
3963.6F49066010o56815o04324p55463O26373K703324K786789j662446k077331R0942
3972.2F49517059J49994J669541l12653n69916R38645j066132k827835n15518K087173
$$ plain form
3980.9 649070358 648102646 647329178 649454422 650812073 649076462 647295990 648310776 648783188 649467545
3989.6 649467545 648665771 647511673 648252487 647275925 646694565 648098145 649897003 649247513 647016144
3998.3 647016144 647144852 648797684
4000.2 648797684
$$ packed form
3980.9F49070358r67712p73468K125244J357651j735611j780472J014786M72412O84357
3989.6F49467545q01774j154098P40814r76562n81360J403580J798858o49490k231369
3998.3F47016144J28708J652832
4000.2F48797684
##END=$$ End of the data block
