##TITLE=$$ Begin of the data block
##JCAMP-DX=5.00 $$ ACD/SpecManager v 10.08
##SPECTROMETER/DATA SYSTEM=Varian
##DATE=07 Jan 2013 10:37:24
##DATA TYPE=INFRARED SPECTRUM
##DATA CLASS=XYDATA
##ORIGIN=
##OWNER=
##NPOINTS=3735
##FIRSTX=399.26403809
##LASTX=4000.35498047
##MAXX=4000.35498047
##MINX=399.26403809
##MAXY=86.97782135
##MINY=5.52855778
##XFACTOR=1.0000000000
##YFACTOR=0.000000100000000
##FIRSTY=42.55334854
##DELTAX=0.96440572
##XUNITS=1/CM
##YUNITS=TRANSMITTANCE
##XYDATA=(X++(Y..Y))
399.3D25533485K88338662J55906067j70667725k04602776O9668427q8164940p8473167
406C97538033J35849914q3991127m2400665J63468284N8168412j50195198r7095643
412.8C81342010K7681275k2659683j9807091J22561150K06838760Q1403122l81956864
419.5C95402679L2363434J70769310J5089875q2166329m1644173j5100822K0565720
426.3D95279694M184723k1843644L868294O3686447M8400307q9728966p1199379O2334748
434D94982224N8377990m3496551L880005L7149429m0596390l1055298k5674820j2510643
441.7D41055946O2275658L5308037j5614395l8612671o8848953K4716758P2790146
448.4E13070526M3395996j6340790p4365043L8211784Q0753441l7831268j1976242
$$ plain form
399.3 425533485 713872147 869778214 699110489 494507713 564176140 476011200 397538033
406 397538033 533387947 449396820 406996155 570464439 628632851 478437653 381342010
412.8 381342010 409023285 386363602 366556511 489117661 695956421 777359543 395402679
419.5 395402679 427766113 598535423 613625298 531458969 489814796 474713974 495279694
426.3 495279694 499464417 477620773 481489067 545175514 593575821 503846855 432647476 494982224
434 494982224 553360214 509863663 513743668 550893097 510296707 479241409 453566589 441055946
441.7 441055946 503331604 538639641 523025246 484412575 415563622 440280380 513070526
448.4 513070526 556466522 540125732 465760689 503972473 584725914 546894646 534918404
455.2E34918404q9118538n5667458P6627998n6484909J0879212J08652534L9598389
462E69405632k0688248k7763862j3591996Q294831q525543k4106179L7403527K5403633
469.7E45831795q3179322n3875160J2692337L3058243N178909l9826088l042411N1306800
477.4D68145103K9997445J6434669j8852577l406639M8318443L3020935l6144066r4011917
485.1D43501396J0056267M6741562k3833275L6121979k8093109m8287964M7340698
491.8D83547554J2743378k7785263O849136M4190102l6437188n8040390J7537003N3710327
499.6D96314659N4298821o0169983p1783600K5933685k235412j3610802j8217697j988220
507.3D08541451M3012657M3124122L8100281J4979286k8802185k2512398r69772R644966
$$ plain form
455.2 534918404 445799866 390132408 466760406 410275497 421154709 529807243 569405632
462 569405632 548717384 520953522 507361526 515656357 507130814 483024635 520428162 545831795
469.7 545831795 462652473 408777313 421469650 454527893 459706802 419880714 416838303 468145103
477.4 468145103 498142548 514577217 495724640 492318001 540636444 573657379 537513313 443501396
485.1 443501396 453557663 500299225 476465950 512587929 484494820 436206856 483547554
491.8 483547554 496290932 468505669 475354805 519544907 483107719 425067329 442604332 496314659
499.6 496314659 550613480 490443497 418659897 444593582 442358170 428747368 410529671 408541451
507.3 408541451 451554108 494678230 532778511 547757797 518955612 496443214 495473442 505118408
515E05118408M0739060o250038l7710991k5055504m1471024J6039162Q670883q33816
522.7D59246140L2683868j8507919k5924492R473610k326470n48401K1079445k86941
530.4D74888840k9689369m853631R159432J0281448l937301K589302K6577034r968682
538.1D75047073j8935585P787972P826004K338333l847275r176941j5263481p522354
545.9D38253746j926422K497597K6097526J2564964q953018l871193l807335R957238
553.6D70813103J0350837n504074p112617j0100556l238678j264724k871781J0128517
561.3D61200027N057221q23517J1606102M97933r142609O20155q292732n835419k033844
570D52853317k930832J2564202L329010j4583206j0815812J1191178J5705185r150849
$$ plain form
515 505118408 545857468 539607430 501896439 476840935 435369911 451409073 460079956 459246140
522.7 459246140 491930008 473422089 447497597 456971207 454644737 454096336 475175781 474888840
530.4 474888840 445199471 440345840 449505272 459786720 455849419 458438721 485015755 475047073
538.1 475047073 456111488 463899460 471725464 474063797 470216522 461039581 445776100 438253746
545.9 438253746 436327324 438824921 464922447 477487411 468534393 464663200 460855865 470813103
553.6 470813103 481163940 475659866 468547249 458446693 455208015 453943291 451071510 461200027
561.3 461200027 466257248 465433731 477039833 477537766 468395157 469015312 460722580 454887161 452853317
570 452853317 449922485 462486687 465815697 451232491 440416679 451607857 467313042 458162193
577.7D58162193j0386734p547798o534195J394692M53300J952553J7166481J2849541
585.4D67510033p078171k13738j0970268j783867J4712639n569954M890022l641052
593.1D57855644j2749977K177582j0751495n410500N200882m813347J202850J7291947
600.8D50003586J278038j4393463l411637J704369J1861000O959839k0133476k4930954
608.5D08937302k5094452k6836586j4886513n709229r112396j1708545j2764283n544471
616.3B97280827Q721828P040443n746803j4174442j3206501m398308m770756j0320301
624B60425987l827839k300472N191441J5149364J8450184L2827663J5459900N664063
631.7C47040291J9842949P913894p042045k0851059k8541088j6452198O725921J1266861
$$ plain form
577.7 458162193 447775459 440227661 433693466 435088158 435541458 437494011 454660492 467510033
585.4 467510033 460431862 460218124 449247856 447463989 462176628 456606674 461496696 457855644
593.1 457855644 445105667 447283249 436531754 431121254 436322136 431508789 432711639 450003586
600.8 450003586 451281624 436888161 433476524 435180893 447041893 454001732 433868256 408937302
608.5 408937302 383842850 357006264 342119751 336410522 327298126 315589581 302825298 297280827
616.3 297280827 306002655 313043098 307296295 293121853 279915352 275517044 270746288 260425987
624 260425987 256598148 254297676 259489117 274638481 293088665 325916328 341376228 347040291
631.7 347040291 366883240 374797134 367755089 346904030 318362942 301910744 308636665 319903526
639.4C19903526Q78411r46598Q113002K8213768K2937432R161339J7166137L7535629
647.1D42962646K9403115L821220j955795r114609L688126J1545791p986564n907936
654.8D66455994J2524719J4811745J255416O890412O928901o366424r487190n757828
662.5D87255745J2060203K1012192R007721p419853n964890o577301j2232437L763619
670.3E00904999j202469l644600J0556450J2033501m766121l886147J1251450O139564
678E27386627q869667j5911941N65796J1988410l186988j1363945q343888N322457
685.7D97586861J2145805N219193K143478p052231r456024N628967O665802k87819
693.4E12594032K074013q226051q184128J681213o060028p409897L289795J0033188
$$ plain form
639.4 319903526 320781937 319835339 327948341 356162109 379099541 388260880 405427017 442962646
647.1 442962646 472365761 476186981 474231186 465116577 468804703 480350494 472363930 466455994
654.8 466455994 478980713 493792458 495047874 501938286 508867187 502500763 493013573 487255745
662.5 487255745 499315948 520328140 529335861 521916008 515951118 509373817 497141380 500904999
670.3 500904999 499702530 496057930 506614380 518647881 513881760 509995613 521247063 527386627
678 527386627 518516960 502605019 503170815 515159225 511972237 500608292 492264404 497586861
685.7 497586861 509732666 514951859 517095337 510043106 500587082 506216049 512881851 512594032
693.4 512594032 514668045 506441994 498257866 499939079 493879051 486469154 489758949 499792137
701.1D99792137O653519l078385j0901184l004684P033615J291542k508354L861236
708.8D99139442J0656128K569275J645508K477684n968704N837479L816490j1630555
716.6E08542747k557067R108390N661316K926979N704842N134773k90985j2770653
724.3E21460342o135368P941933Q316650O620369j082115k01759j666947m130287L146133
733E34268951L155480p335854j5240020P985839J2386666j2392426l682060M850731
740.7E23997307j943779l67203Q68836J959381M135551J31569k617607k38304O005707
749.3E31931458Q763046k042237k813682J0684471J7620049Q356781p735482j3634185
757.1E51130219m490510J0458107R579659O321373j751747j2811585L861542J1198692
$$ plain form
701.1 499792137 506445656 503367271 492466087 489461403 496495018 497786560 495278206 499139442
708.8 499139442 509795570 512364845 514010353 516488037 510519333 516356812 520173302 508542747
716.6 508542747 505985680 515094070 520755386 523682365 529387207 534521980 534230995 521460342
724.3 521460342 515324974 523266907 531583557 538203926 537121811 536920052 535253105 531122818 534268951
733 534268951 537424431 530088577 514848557 522834396 535221062 522828636 519146576 523997307
740.7 523997307 522053528 521686325 522555161 524514542 528650093 528781662 526164055 525925751 531931458
749.3 531931458 540694504 538652267 535838585 546523056 564143105 572499886 564764404 551130219
757.1 551130219 546639709 557097816 566677475 572998848 571247101 558435516 562297058 573495750
764.8E73495750k36167m095765k839584M049225M431839k713547R0599K518273l284264
773.5E71416359l32527K485161K379417L235588P242584J1510125l210640j0313340
781.2E84412727K00844J1670532R607850k632561K22931M273681J447487j3683128
788.9E95520363j2372971P705879N108033M817924O224709M394150j10703p671165
796.6F03616219j150589p38335q31566M782143O002388o54450l499145J699600j576729
805.3F07649536l907318l333588M618836N354500p554207j599770O100998l481064
813F03847923l571090O465644Q229866M266320o949005r37195Q630028n510712l910751
821.7F10561028j907502l150177K34185m594689J334458J631927p63092k460861m938584
$$ plain form
764.8 573495750 573259583 569163818 566324234 570373459 574805298 572091751 572182350 574700623 571416359
773.5 571416359 571083832 573568993 575948410 579183998 586426582 597936707 594726067 584412727
781.2 584412727 584613571 596284103 605891953 603259392 603482323 607756004 609203491 595520363
788.9 595520363 583147392 590853271 595961304 600779228 607003937 611398087 611287384 603616219
796.6 603616219 602465630 601727295 600895729 605677872 611680260 611025810 607526665 609226265 607649536
805.3 607649536 603742218 600408630 605027466 610381966 602827759 601227989 607328987 603847923
813 603847923 600276833 606742477 614972343 619238663 612289658 611352463 619982491 614471779 610561028
821.7 610561028 608653526 605503349 605737534 601142845 602477303 604109230 603346138 600885277 595946693
830.4E95946693m44755o038017j4067383p740288M428596k630348p226906R86062o79627
839E62534027j823349j2321j592446p695427o804733k697868n001221m412079L022118
847.7E35516701Q884430M456939O189957J345940p541657p84111k75688K763710Q934288
856.4E59490509P298126n37491m070358N427895P539329K781258j573486J518058J81237
865.1E78055077k743607P945557L777389N816155J2416877r6817K021904L761826n623741
873.8F05330620k94647O691780l902512j0360222R90372O814613k996597r307861o222267
882.4E86743279j814080P119522M352951p475433j165504J199836j0019722o556091
890.2E72384758P521324O542320l769569k589607K131271k787247o817283o52657J967888
$$ plain form
830.4 595946693 595501938 589463921 575396538 567656250 572084846 569454498 562227592 563213654 562534027
839 562534027 560710678 560698357 559105911 551410484 544605751 541907883 536906662 532494583 535516701
847.7 535516701 544401131 548858070 555048027 556393967 548852310 548068199 547792511 550556221 559490509
856.4 559490509 566788635 566251144 562180786 567608681 575148010 577929268 576355782 577873840 578055077
865.1 578055077 575311470 583257027 587034416 592850571 605267448 605170631 607192535 610954361 605330620
873.8 605330620 605035973 611727753 607825241 597465019 598455391 605270004 602273407 592965546 586743279
882.4 586743279 584929199 592048721 596401672 588926239 587760735 588960571 578940849 572384758
890.2 572384758 579906082 586448402 582678833 580089226 582220497 579433250 572615967 571963310 573931198
898.8E73931198j349373k76031j441918j458473N768204P677574j213989o182747k206040
907.5E73248405k186622l402939n12085k120514q584442r609375n397911m058724k308998
916.2E35066795k801437m276619l40729l079529o707840R56727M867363l752022j0303421
924.9E09629288p681580L174858O311798l607444k279282j971512m310684q35648j499595
933.6D96930199K947387M326363N357742O328240L668060L226624K869834Q023835
941.3E33678284K991333K86483P232171M985771M534836N884628N565185k208137m272461
949.9E58678093L933678L778381L017464Q6326q38012l040696m689674K966576j574250
958.6E62317886n910225K585221J806831q668518p528801k979317k682228P71256l205872
$$ plain form
898.8 573931198 572581825 572305794 570863876 569405403 575173607 582851181 581637192 575454445 573248405
907.5 573248405 571061783 567658844 567146759 565026245 556441803 546832428 541434517 537375793 535066795
916.2 535066795 532265358 527988739 527648010 524568481 517860641 518817368 523684731 519932709 509629288
924.9 509629288 501947708 505122566 511434364 507826920 505547638 503576126 499265442 498429794 496930199
933.6 496930199 499877586 504203949 509561691 515889931 519557991 522784615 525654449 533678284
941.3 533678284 536669617 536956100 544188271 549174042 553708878 559593506 565158691 562950554 558678093
949.9 558678093 562611771 566390152 569407616 569493942 568655930 565615234 560925560 563892136 562317886
958.6 562317886 556407661 558992882 560799713 552131195 544602394 541623077 538940849 539712105 536506233
967.3E36506233m223175k433700l922081n04876K80228j761055k135277j484298m299126
976E16022873k353745J909333j62735k880783q171006o975937j738662p41081l76435
984.7D94531822N8518k596169n425110m115715p090606k654534J501579q391723j3367157
993.3D52450905j9468384k7131462j9171448M071770J8849335J6122055R603767L292885
1001.1D38619423M217071N774765l978195k865638O815185M416504K26097n265694
1008.8D47959518p342910p06292k821350l730583k48489j060600m636078q802529k694473
1017.5D15916214J391220j397972l946381m444008O53077j320534o886139q573875
1025.2C91391602m490357J877937q95233l476829k358399N58930m157257j1986924
$$ plain form
967.3 536506233 532283058 529849358 525927277 525422401 525702629 523941574 521806297 520321999 516022873
976 516022873 513669128 515578461 515415726 512534943 504363937 497388000 495649338 494908257 494531822
984.7 494531822 494590340 491994171 486569061 482453346 475362740 472708206 474209785 465818062 452450905
993.3 452450905 432982521 405851059 386679611 390751381 409600716 425722771 435326538 438619423
1001.1 438619423 442836494 448611259 444633064 441767426 448582611 452999115 453225212 447959518
1008.8 447959518 440616608 439910316 437088966 433358383 433109894 432049294 427413216 418610687 415916214
1017.5 415916214 417307434 415909462 411963081 407519073 408172150 406851616 399965477 391391602
1025.2 391391602 386901245 388779182 387883949 384407120 382048721 382607651 378450394 366463470
1032.9C66463470o12793K537041n534363k393646r95827N16091K51083n91583n3024
1041.6C59586449j941262k21481k212295n175286k346649K590866M237213K449990
1049.3C56967545n50728j877594K941208M997711K130279l48854j24626k099380n89829
1058C61445732J89438l293419J319237o723938n393486J0017052M143104k726707m242249
1066.6C54734764k41928q61511m783974m8866l28827j2283p7744J180191J649208q19397
1076.3C50389633m231224p411384k738076J029930J329270k126007o43196o66466n288391
1085C29644089k866669l760147k614327l021011n711880p928333r271641p775879p882328
1093.6B78811874m879684j0913048j2740841n748253n763225j1089935j2549477j1708202
$$ plain form
1032.9 366463470 365850677 368387718 362853355 360459709 359463882 359979973 360231056 359639473 359586449
1041.6 359586449 357645187 357423706 355211411 350036125 347689476 350280342 354517555 356967545
1049.3 356967545 356416817 354539223 357480431 362478142 364608421 364259567 364134941 362035561 361445732
1058 361445732 361635170 358341751 359660988 352937050 347543564 357560616 361703720 358977013 354734764
1066.6 354734764 354492836 353631325 348847351 348798485 348469658 348457375 348379631 349559822 351209030 350389633
1076.3 350389633 346158409 338747025 336008949 337038879 338368149 336242142 335598946 334932480 329644089
1085 329644089 326777420 323017273 320402946 317381935 311670055 303741722 294470081 286694202 278811874
1093.6 278811874 273932190 263019142 250278301 244530048 238766823 227676888 215127411 203419209
1101.4B03419209k0078488r532375k757225j3049240j0614891q439999q811998r532261
1109.1A20602732m852610m515171k975283k945699o626654j442080j801691l64942
1116.8I5078602l749733p35026K907162j889877L066740L366699K544937J342650K549553
1125.5A04481707k325697m259997N376187L570451j200866n035944l168755l238220
1133.2I4198866J017036P470036j599245o238899p752028o063709k018147l21412j018524
1141.9G7673974n85437l823581p625751L59774l703585k716394M035917p87678l509469
1150.5E9317770k060890K18415k189717K092132M16813J969066N274420j585269J839685
1159.2F5292425J984539J736374j483307j064586L850255K257890K294369Q19178P446818
$$ plain form
1101.4 203419209 183340721 173808346 171051121 158001881 147386990 138946991 130134993 120602732
1109.1 120602732 115750122 111234951 108259668 105313969 98687315 97245235 95443544 95078602
1116.8 95078602 91328869 90593843 93501005 91611128 94677868 98044567 100589504 101932154 104481707
1125.5 104481707 102156010 97896013 103272200 106842651 105641785 100605841 97437086 94198866
1133.2 94198866 95215902 102685938 101086693 94847794 87095766 81032057 79013910 78692498 77673974
1141.9 77673974 77088537 73264956 65639205 65998979 62295394 59579000 63614917 62827239 59317770
1150.5 59317770 57256880 57475295 55285578 57377710 57794523 59763589 65038009 63452740 65292425
1159.2 65292425 67276964 69013338 67530031 66465445 70315700 72573590 74867959 75687137 83133955
1167.9H3133955O893978K612095K982779L969774N653276L245211P471056N815010
1175.6A21777134O385622J1410570J0252333N967560K141361O837015R400215Q567200
1183.3A82739010P336254Q357887O657601N534362P947598O108494P190017N456543
1191B37327766M837895L760719N138474Q331451L678131N789662Q254737O899205O228904
1199.7B90246944P194901M201660M140244J0240631P441921Q161964O141854L033905
1207.4C40804024M919700M129448N489922L205757M595146N962639L660889L073730
1215.1C75841255K243500M981308M715462q1787l089982J4191L312760M191322M311676
1223.8C96439705J497040m17252j833000P39365K961463L4829k551918q40416M43191
$$ plain form
1167.9 83133955 90027933 92640028 95622807 99592581 105245857 108491068 115962124 121777134
1175.6 121777134 128162756 139573326 149825659 155793219 157934580 164771595 174171810 182739010
1183.3 182739010 190075264 198433151 205090752 210625114 218572712 224681206 231871223 237327766
1191 237327766 242165661 245926380 251064854 259396305 263074436 268864098 277118835 284018040 290246944
1199.7 290246944 297441845 301643505 305783749 316024380 323466301 331628265 337770119 340804024
1207.4 340804024 345723724 349853172 355343094 358548851 363143997 369106636 372767525 375841255
1215.1 375841255 378084755 383066063 387781525 387699738 384609756 384623947 387936707 392128029 396439705
1223.8 396439705 397936745 397519493 395686493 396425858 399387321 399422150 396870232 396029816 396473007
1232.5C96473007P8697M677163L685417R11941j05819p49970J796303J983795K627716
1241.2D11378250r40323M2992M204597J249352l92914Q98438L970108J45263k633705
1249.9D17922058p04651O97518K146568k34795M48990n59807K3041K050324k35024
1258.5D21554222J302223K649460J181297J360512L778115N42106M07486L345337M64287
1267.2D36585045K039108J434403N26504N68619r20677K530517L601799M005013M329529
1275.9D54699860L089866J999092m69093q90198K721253M830780K718124P92465Q57811
1284.6D70349960L596917M335670K975960L442840K823410K594033K204742P83882
1292.3D93107414J752663M098244L871688J971932O05583J39771K327537L679695L222351
$$ plain form
1232.5 396473007 396551704 401228867 404914284 405826225 405720406 404970436 406766739 408750534 411378250
1241.2 411378250 410437927 410480919 414685516 415934868 415541954 416440392 420410500 420555763 417922058
1249.9 417922058 417217407 417914925 420061493 419826698 420275688 419715881 419738922 421789246 421554222
1258.5 421554222 422856445 425505905 426687202 428047714 431825829 432367935 432775421 436120758 436585045
1267.2 436585045 438624153 440058556 440585060 441153679 440233002 442763519 446365318 450370331 454699860
1275.9 454699860 457789726 459788818 459319725 458429527 461150780 465981560 468699684 469492149 470349960
1284.6 470349960 473946877 478282547 481258507 484701347 487524757 490118790 492323532 493107414
1292.3 493107414 494860077 498958321 502830009 504801941 505407524 505547295 507874832 511554527 514776878
1301E14776878K933197O03104j90468J048737K117500L175621R33762K53486J332894
1309.7E26984711j047211j291084P53288K400322K739525J326179P73430Q21991J549263
1318.3E35010414J176796N73540O64024j180229n56564J049156Q75511L032646L856316
1327E44501610J287231j258278j245994l23372j287460K277603L815269l33061N61333
1335.7E47994881n56069j961059J038398L54691m02260o29349r3193K021790L82919
1344.4E48150749l220253q79707J991081j200294k171669o47507P70645K123222J98250
1353.1E45114517q53805o5117q44841k519150j533165M75235N23949J366424j451530
1361.7E40212517l477211K673683R79691k714081q11806m72298j286544p30591j570702
$$ plain form
1301 514776878 517710075 518313179 518122711 519171448 521288948 524464569 525398331 525651817 526984711
1309.7 526984711 525937500 524646416 525399704 527800026 530539551 531865730 532639160 533461151 535010414
1318.3 535010414 536187210 536760750 537424774 536244545 535687981 536737137 537612648 540645294 544501610
1327 544501610 545788841 544530563 543284569 542961197 541673737 543951340 547766609 547433548 547994881
1335.7 547994881 547438812 545477753 546516151 546870842 546468582 545839233 545746040 547767830 548150749
1344.4 548150749 544930496 544050789 546041870 544841576 542669907 542022400 542793045 544916267 545114517
1353.1 545114517 544260712 544195595 543350754 540831604 539298439 539773674 540297623 541664047 540212517
1361.7 540212517 536735306 539408989 540388680 537674599 536862793 536390495 535103951 534373360 532802658
1370.4E32802658j578674m10424m32319r17626r30099l89900l51830k460975k840348
1379.1E22490463N58510K448502M92134k054978j886978l90625M06456R73740K160950
1387.8E25198174j9799j628227m1580J454353J693077J964340P1488j416397l17993
1396.4E26957436j874352j627922k254868k524147J084557J894188M7646m6959p48825
1405.1E20906754l646660j815644P93724J48011q11425j220512j414490m20074n61028
1413.8E11958656k630195j874276J416436J711464M86183j498413N62668K268943J535683
1422.5E13937149P12013q23517N74189k38953r06334K575264K360382j665764r27238
1431.2E15597191L256340R29603k03857L123169n89485n853844L361893N660400K601929
$$ plain form
1370.4 532802658 531223984 530813560 530381241 529463615 528533516 528143616 527791786 525330811 522490463
1379.1 522490463 523048973 525497475 525989609 523934631 522047653 521657028 522063484 523037224 525198174
1387.8 525198174 525178375 523550148 523508568 524962921 526655998 528620338 528691826 527275429 526957436
1396.4 526957436 525083084 523455162 521200294 518676147 519760704 521654892 521702538 521655579 520906754
1405.1 520906754 517260094 515444450 516238174 516386185 515574760 514354248 512939758 512519684 511958656
1413.8 511958656 509328461 507454185 508870621 510582085 511068268 509569855 510132523 512401466 513937149
1422.5 513937149 514649162 513825645 514399834 514160881 513254547 515829811 518190193 516524429 515597191
1431.2 515597191 518853531 519783134 519579277 522702446 522112961 516259117 519621010 525281410 527883339
1439.8E27883339j81694Q90350K044411K346802L05557K669678K840805j547356j262016
1448.5E35989876J999206L678933J702842J92070q57849j7204M939422M339753l404198
1457.2E48562851l456802K268066J256409j64528J094360K461167K824859L682251
1464.9E58528633K652054r1820o55479q43315J824722M993400K572060L151932K622642
1473.6E74754829Q812J879311J986465L716927L267670J892166K74391j086006J892357
1482.3E88586922K661972J234932J456108J447754k609558j651268L806686j413574
1490E93519974n35164K028808j210403j133270J77688J799508j938210j228828j331482
1498.7E90148621l922921m10995P40776k238388m344750J255303N907211N087967j0321236
$$ plain form
1439.8 527883339 527701645 528591995 530636406 532983208 533288765 535958443 538799248 537251892 535989876
1448.5 535989876 537989082 541668015 543370857 543562927 542705078 542687874 547627296 551967049 548562851
1457.2 548562851 545106049 547374115 548630524 548465996 549560356 552021523 554846382 558528633
1464.9 558528633 561180687 561088867 560433388 559590073 561414795 566408195 568980255 572132187 574754829
1473.6 574754829 574763641 576642952 578629417 582346344 585614014 587506180 587780571 586694565 588586922
1482.3 588586922 591248894 592483826 593939934 595387688 592778130 591126862 594933548 593519974
1490 593519974 592984810 595013618 593803215 592669945 592847633 594647141 592708931 591480103 590148621
1498.7 590148621 586225700 585814705 586555481 584317093 579972343 581227646 587134857 592222824 581901588
1507.3E81901588n441665J257820m341202l673286k461090k765808j783562m92020
1515.1E62200775L488274L920822r053383o352920J646804N079079M712448o826782
1522.8E58815117q445015M78935j083603o74629L47023n5389j8578k616882j318856
1531.5E45428123p88230O20994j359672n86090n52598k274589J48926n853539p986145
1540.1E26797180J119919J49307L922882K775078n86548k394638K079125P41462m23317
1548.8E34180450l735427p71676N928269K416115N17540k326012M60091L205299N626411
1557.5E45501060J1354828o937523p53440k021065j331329n63698m8180K072067J956025
1566.2E49228745M50515j96800J444435l030472R98383K652855n69878q52928p14035
$$ plain form
1507.3 581901588 576459923 577717743 573376541 569703255 567242165 564476357 562692795 562200775
1515.1 562200775 565689049 569609871 560556488 554203568 555850372 560929451 565641899 558815117
1522.8 558815117 550370102 550849037 549765434 549090805 549437828 549382439 549363861 546746979 545428123
1531.5 545428123 544639893 545260887 543901215 543315125 542762527 540487938 540636864 534783325 526797180
1540.1 526797180 527917099 528066406 531989288 534764366 534177818 531783180 533862305 534603767 534180450
1548.8 534180450 530445023 529673347 535601616 538017731 538535271 536209259 536669350 539874649 545501060
1557.5 545501060 556855888 549918365 549164925 547143860 545812531 545248833 545200653 547272720 549228745
1566.2 549228745 549679260 549482460 550926895 547896423 548894806 551547661 550977783 550124855 549410820
1574.9E49410820P25q749619k90985K829971J027794k47764l807373j917115n87768
1583.5E37668686k501488m371567l171386k393265k975159n25551k146873l650513
1591.2E15932884o277885l969345j944123k741928j406707m040108k057953k098694
1599D91396141j563377k192803m475364l319474m102211l445091m047127j398277k299423
1607.6D64552994m012833n311508m279556o17905k628822j022568l603325j556244
1615.4D41520233j344032o996613J059380l121224k618713n135460j909561o66695
1623.1D20787315m916000Q44383p64580L29247l401146l234215l484916k290574J634713
1631.7D05504227j178627j133004l068389J5449k994690q76007P78542j204110L56217
$$ plain form
1574.9 549410820 549411545 540661926 540370941 543200912 544228706 543980942 540173569 538256454 537668686
1583.5 537668686 535167198 530795631 527624245 525230980 522255821 521730270 519583397 515932884
1591.2 515932884 509654999 505685654 503741531 500999603 499592896 495552788 493494835 491396141
1599 491396141 489832764 487639961 483164597 479845123 475742912 472297821 468250694 466852417 464552994
1607.6 464552994 460540161 455228653 450949097 450331192 447702370 446679802 443076477 441520233
1615.4 441520233 440176201 433179588 434238968 431117744 428499031 423363571 421454010 420787315
1623.1 420787315 415871315 416715698 415951118 416280365 412879219 409645004 406160088 403869514 405504227
1631.7 405504227 404325600 403192596 400124207 400139656 397144966 396268959 397047501 395843391 396199608
1640.4C96199608j448822P64808K09122J767273J359062m32968J648102n450325O76804
1649.1C95292664J844711N061836M366608M307098m74548o358719J972198J185685
1656.8D07197533L648948J692200J664085K081337O34079L860245J788788L779449
1664.5D26346664J416893J639252L811264K721977J352196J86196M258995K540245
1672.3D44273682M270973N056343M988708J217461J278725M147186L837318M808045
1680D73878441P77931K429085O477051R164581J446648k943459L990898J412316L794784
1688.6E00428276M914208K160110M119835M235878N678253O167870P475509k37884
1696.4E34942055M390487O452637O183014J9662170r808959q68340N918579Q042717
$$ plain form
1640.4 396199608 394750786 395515594 395724716 397491989 398851051 398418083 400066185 394615860 395292664
1649.1 395292664 397137375 402199211 406565819 410872917 410398369 404039650 406011848 407197533
1656.8 407197533 410846481 412538681 414202766 416284103 416918182 420778427 422567215 426346664
1664.5 426346664 427763557 429402809 433214073 435936050 437288246 437474442 441733437 444273682
1672.3 444273682 448544655 453600998 458589706 459807167 461085892 465233078 469070396 473878441
1680 473878441 474656372 477085457 483562508 492727089 494173737 491230278 495221176 496633492 500428276
1688.6 500428276 505342484 507502594 511622429 515858307 521536560 527704430 535179939 534942055
1696.4 534942055 539332542 545785179 551968193 571630363 561821404 560953064 566871643 574914360
1704.1E74914360M704514J085853K551689K239952N259896M899788J288833J375885
1711.8E98320770L239022N092010J631432j810151L477135Q857956J130753K06299
1719.5F20145226K733039N83458J247864J620102O44760J375923K186013K281799J391067
1728.2F34209251J488953O71997k27966K671089M677811j376953o351128M007759L694153
1736.9F43464966L382950M868393K100906m023666J161346K388535J218719K029648
1744.6F56591797L666000L292923R70307K440261L047486K568817J137619Q7967K467728
1753.3F76270905J275405K914811N125274J064987p47909J115341L302765M211044
1761F94532623k738571l217163K853546L041153J008225J220092L365250l08838j3504
$$ plain form
1704.1 574914360 579618874 580704727 583256416 585496368 590756264 595656052 596944885 598320770
1711.8 598320770 601559792 606651802 608283234 606473083 609950218 618808174 619938927 620145226
1719.5 620145226 622878265 623461723 624709587 626329689 626974449 628350372 630536385 632818184 634209251
1728.2 634209251 635698204 636370201 636142235 638813324 643491135 642114182 635763054 639770813 643464966
1736.9 643464966 646847916 651716309 653817215 649793549 650954895 653343430 654562149 656591797
1744.6 656591797 660257797 663550720 664521027 666961288 670008774 672577591 673715210 673803177 676270905
1753.3 676270905 677546310 680461121 685586395 686651382 685903473 687018814 690321579 694532623
1761 694532623 691794052 688576889 691430435 694471588 695479813 696699905 700065155 699756317 699742813
1769.7F99742813J981201J07422r3078L3111K378159k2278j54343K744293j14669J669616
1779.3G08272247K675782k481766j004105K007446J217728m59976L23715J321640R67102
1788G12839813M38309K306137K369690O56128k755661j833878L215027J009293l52707
1796.7G17892151J225281J758651R17969j680374J527405j91345j731339J61972L12424
1805.3G20192795K249603J209717o82984R31550K113494r33227j793213K11182M76684
1814G23975601P0420n20478K493515J895523j181946O42930R9945p9956M02908Q03909
1823.7G28602371K201996j000900j478882N96847J358033N70221l468170K802886K731019
1832.3G32915421j770630M29382J120148N93872m71039n98526J692123p8354k23846
$$ plain form
1769.7 699742813 701724014 701831436 701738358 701771469 704149628 704127350 703973007 706717300 706602631 708272247
1779.3 708272247 710948029 708466263 707462158 709469604 710687332 710227356 710551071 711872711 712839813
1788 712839813 713278122 715584259 717953949 718610077 715854416 714020538 717235565 718244858 717892151
1796.7 717892151 719117432 720876083 721794052 720113678 721641083 721449738 719718399 719880371 720192795
1805.3 720192795 722442398 723652115 722969131 723900681 726014175 725080948 723287735 723498917 723975601
1814 723975601 724046021 723525543 726019058 727914581 726732635 727375565 727475510 727395554 727798462 728602371
1823.7 728602371 730804367 729803467 728324585 728921432 730279465 730849686 727381516 730184402 732915421
1832.3 732915421 731144791 731574173 732694321 733288193 732817154 732218628 733910751 733832397 733608551
1841G33608551K40097K288666K871933n018692j551361J300659R79004j98136J040802
1849.7G35561523K78855j376877R53522J106186L58429o37589l45993m37393l26996
1858.4G35133667R51157P04269K440338M7531j898269K95181J615753Q87680p29904
1867.1G39447403L10974l048477j527939K631531K037277J154633j231614L75519J498337
1875.7G41647644J39923n53970j36109J0682j175919q1406R21326J495438o25763j644287
1885.4G39997559N17654J86005Q09250p9651k157975R842N81971m95682J079330J177826
1895G41626129n70373J251373l76587j516418l41187o92062P08618J500091L63083
1903.7G41952667j24206O53610l19214q51135j83716J34506L23715J54572P43866m88205
$$ plain form
1841 733608551 733848648 736137314 739009247 733990555 732439194 733739853 734718857 734520721 735561523
1849.7 735561523 735840378 734463501 735417023 736523209 736881638 736244049 735898056 735460663 735133667
1858.4 735133667 736084824 736789093 739229431 739276962 737378693 737673874 739289627 740177307 739447403
1867.1 739447403 739758377 736709900 735181961 737813492 739850769 741005402 739773788 740149307 741647644
1875.7 741647644 741787567 741233597 741097488 741108170 739932251 739850845 740772171 742267609 741641846 739997559
1885.4 739997559 740515213 740701218 741510468 741430817 739272842 739282684 739864655 739368973 740448303 741626129
1895 741626129 741055756 742307129 741930542 740414124 740072937 739380875 740089493 741589584 741952667
1903.7 741952667 741828461 742482071 742162857 741311722 741128006 741262512 741586227 741740799 742484665 741996460
1913.3G41996460j65863l94058J21994J990280k097321p36160J561966J099396J298904
1922G44675598j866684k425384j0605J710968M19464p25861R7275j216507r48944J134949
1931.7G40844269J025543j158447j040344J31530M31290P57599N08728K62680p25021
1940.3G41037827o33545l25547o29043Q30765J674575k18124j012650J415482L90625
1949G42530365j250381j90049O89850N52826j176681j403580K62298R32084K79769
1957.7G41226501n9280p05643o84890O46820m7684n54733j62049L33405R57031L35846
1967.3G41285324o65665J86005Q00934j599045j628647O71387Q92868j83563k67716
1976G39491882J202088M11682p91702l03269R2011k25373J65634L43857j394424j237335
$$ plain form
1913.3 741996460 741830597 741436539 741558533 743548813 741451492 740715332 742277298 743376694 744675598
1922 744675598 742808914 740383530 740372925 742083893 742503357 741777496 741874771 740658264 739709320 740844269
1931.7 740844269 741869812 740711365 739671021 739802551 740233841 740991440 741500168 741762848 741037827
1940.3 741037827 740404282 740078735 739449692 740280457 741955032 741736908 740724258 742139740 742530365
1949 742530365 741279984 741089935 741779785 742332611 741155930 739752350 740014648 740946732 741226501
1957.7 741226501 741167221 740461578 739776688 740423508 740375824 739821091 739659042 739992447 740949478 741285324
1967.3 741285324 740619659 740805664 741606598 740007553 738378906 739050293 739943161 739759598 739491882
1976 739491882 740693970 741105652 740313950 740010681 740102692 739877319 740042953 740386810 738992386 737755051
1985.7G37755051q99048k84882N37186l01437R37728J64948k037506l90701R40399
1994.3G36421738R19113o19507j103668J435013J767196N28260j34278k437973j480484
2003G35295410Q39157L11356k06909L44925J563186p02362k402572j25733M20685j7242
2012.7G35319901N71136R72366P10678l30581j695862n51529l20740j121063K13547
2021.3G33767853j78986k80609P5302l78113J89286M73938P90710m36096j923676j214141
2031G30885468J13372R25217J007080P39517M28467l51791j016541j001663j038132
2039.7G30690994R42383J751022j40762k93045p18536j035309l72391K58331o81533
2048.4G30401154j275025P36694J387711j09177k353820j508255N15442k0981P32650
$$ plain form
1985.7 737755051 736856003 736571121 737108307 736806870 737744598 737909546 735872040 735481339 736421738
1994.3 736421738 737340851 736721344 735617676 737052689 738819885 739348145 739213867 736775894 735295410
2003 735295410 736134567 736445923 736239014 736583939 738147125 737444763 735042191 734916458 735337143 735319901
2012.7 735319901 735891037 736863403 737574081 737243500 735547638 734996109 734675369 733554306 733767853
2021.3 733767853 733588867 733308258 733383560 733005447 733194733 733668671 734459381 734023285 732099609 730885468
2031 730885468 730998840 731924057 732931137 733670654 734099121 733747330 732730789 731729126 730690994
2039.7 730690994 731633377 733384399 733243637 732950592 732232056 731196747 730824356 731082687 730401154
2048.4 730401154 729126129 729862823 731250534 731141357 728787537 727279282 727794724 727773743 728506393
2057G28506393J499329m34265j201248P45392n73960j715851N56488M62189j50604
2065.7G27693863j08109n49392j216660r24606n24521r02710M73480J295090o36368
2074.4G24600067k385712l88488O01120m49372L15018p41730j697006r82742J37481
2083.1G19008636O28891n53054j26648J099624K46506q50220M46091J036682J01471
2091.7G21037979J84021n78461j292343k0370M55856J90811P97348K73743J043854
2100.4G22092438R80072o13556R1324k82212r0103r32998j149292Q90350M07944R73892
2110.1G22367859Q61893K66265L61405m58145o97251M00620J068268j064148K09121
2118.7G23315887J366959L61328R97772j247634j700058K7923M24423P09381p7285
$$ plain form
2057 728506393 730005722 729571457 728370209 729115601 728541641 726825790 727382278 727844467 727693863
2065.7 727693863 727585754 727036362 725819702 724895096 724370575 723467865 723941345 725236435 724600067
2074.4 724600067 722214355 721825867 722426987 721977615 722292633 721550903 719853897 718871155 719008636
2083.1 719008636 719637527 719084473 718957825 720057449 720303955 719453735 719899826 720936508 721037979
2091.7 721037979 721222000 720643539 719351196 719330826 719786682 719977493 720774841 721048584 722092438
2100.4 722092438 723072510 722458954 722550278 722268066 722177963 721244965 720095673 720986023 721393967 722367859
2110.1 722367859 723229752 723496017 723857422 723399277 722702026 723102646 724170914 723106766 723315887
2118.7 723315887 724682846 725044174 726041946 724794312 723094254 723122177 723546600 724255981 724178696
2127.4G24178696o81000k41318o96487j052628J29547J61591M1122o7367P98187K083740
2137.1G24654083N04990o54221o75888o40030j697387p08084K472381K158661j84250
2145.8G25230255q67386O15616q1863o78635O73523R96323l01743j301193K002640
2154.4G26287537J445007j371689P75910K161865P48520j718674j699982n05905K92587
2163.1G26415176j44653k72293P30896K52991O90384q71582j449814R96551R61609
2171.8G27309265r55124j769485q8959N08652R80148K30408j669083n08575P78732
2180.5G24815979K99912q0262J037827j00556J75705K186585N32303J44348k44370
2189.1G28767471j253662r08661J73035Q67386P36618Q62579p60650l91541J507111
$$ plain form
2127.4 724178696 723497696 723256378 722559891 721507263 721636810 721798401 721839523 721772156 722570343 724654083
2137.1 724654083 725159073 724504852 723828964 723188934 721491547 720783463 723255844 725414505 725230255
2145.8 725230255 724362869 724978485 724896622 724217987 724891510 725887833 725586090 724284897 726287537
2154.4 726287537 727732544 726360855 727136765 729298630 730047150 728328476 726628494 726122589 726415176
2163.1 726415176 726270523 725998230 726729126 726982117 727672501 726800919 725351105 726347656 727309265
2171.8 727309265 726354141 724584656 724495697 725004349 725984497 726214905 724545822 724037247 724815979
2180.5 724815979 725115891 725035629 726073456 725972900 726148605 728335190 728867493 729011841 728767471
2189.1 728767471 727513809 726605148 726778183 727645569 728382187 729244766 728484116 728092575 729599686
2197.8G29599686L04565m74319M58908J02157J6022O28281k2202M9439J29776J184768
2207.5G31977081O52542j702957p4005J166229o65969j646119J628724K576675K06451
2216.1G34118652k93426j074372P19986N91889q31375o61240r69925N99213n9509k3957
2225.8G32115936J94321l58810Q30307R689o92902j542129o25611J527024J041565
2234.5G32499390J93557l87115N67703J393051K25449j035462j584930o86340L94439
2243.2G31579742o52313k09274J822204P86973p80716q94623L78723N85251n93109
2251.8G32022858K47421M07791R1629K57416l0670j88065j11542K05994p2021N70373
2261.5G33401184K81296j768036r07059J317063J405639j66549o26297J56097k160263
$$ plain form
2197.8 729599686 729904251 729429932 729888840 729990997 730007019 730635300 730613098 730662537 730792313 731977081
2207.5 731977081 732629623 730926666 730852661 732018890 731352921 729706802 731335526 733912201 734118652
2216.1 734118652 733825226 732750854 733470840 734062729 733231354 732570114 731600189 732199402 732139893 732115936
2225.8 732115936 732310257 731951447 732781754 732791443 732098541 730556412 729930801 731457825 732499390
2234.5 732499390 732692947 732305832 732873535 734266586 734492035 733456573 731871643 731185303 731579742
2243.2 731579742 730927429 730718155 732540359 733327332 732546616 731651993 732030716 732615967 732022858
2251.8 732022858 732270279 732678070 732769699 733027115 732996445 732808380 732696838 732902832 732830811 733401184
2261.5 733401184 733682480 731914444 731007385 732324448 733730087 733563538 732937241 733093338 730933075
2270.2G30933075k118225K303848J729889o52924m47311K19269o56815o06765K066345
2278.8G32770386R43680p1030p85370j439133Q16346k36435K06985K019119J479874
2287.5G35704422m6768j791077j467590j657334l20282J38474k55661Q67157M37546
2296.2G31608887M12597K16599R54437J290894k213o48269m66691J84327j433106j076279
2305.8G31041183M39454P02133K476883J223526j822892p27157J710586m15344l523559
2314.5G31104813j136628K004700R85794r87701j998673r41086N77469K09580L326187
2323.2G33144455K234192l087464k394409m82788j831m05273K971649L410416q21076
2331.9G34567871j665726r42993L2425j531753Q74405K613601J884690O32934j991959
$$ plain form
2270.2 730933075 728814850 731118698 732848587 732195663 731748352 731967621 731310806 730704041 732770386
2278.8 732770386 733714066 733643036 732857666 731418533 732234879 731998444 732205429 734224548 735704422
2287.5 735704422 735657654 733866577 732398987 730741653 730421371 730559845 730304184 731171341 731608887
2296.2 731608887 732021484 732238083 733192520 734483414 734481201 733832932 733366241 733550568 732117462 731041183
2305.8 731041183 731480637 732182770 734659653 735883179 734060287 733333130 735043716 734628372 731104813
2314.5 731104813 729968185 731972885 732958679 731970978 729972305 729031219 729608688 729818268 733144455
2323.2 733144455 735378647 732291183 729896774 729413986 729412155 729006882 731978531 735388947 734567871
2331.9 734567871 732902145 731959152 731991577 730459824 731334229 733947830 735832520 736465454 734473495
2340.6G34473495M86908k771530m99115K331391j787796K812805K114639j618271k197113
2349.2G33345413j253586J374207K006760K182083j983567k523803J754837j199875
2356.9G33702469j558075M503937K254944r847260o908417O670914Q239670j925049
2364.7G35133133m936600M848404M535599j201935j159439j01089J494598j865311
2372.4G36747360j858215J378403J65710J418839J161346l93143P26471M93851k84958
2381.1G39555664r61456j91651L63083K49634J789627N57175k115021j744614j23062
2389.7G37379379N50385Q61587P43409q56858q83713N42222L27911q6365N87845K94571
2399.4G39460373l49960Q22982N26047j108246k91061O7291j036453K68021Q95843
$$ plain form
2340.6 734473495 734960403 732188873 731689758 734021149 732233353 735046158 737160797 735542526 733345413
2349.2 733345413 732091827 733466034 735472794 737654877 735671310 733147507 734902344 733702469
2356.9 733702469 732144394 736648331 738903275 729056015 722147598 728818512 737058182 735133133
2364.7 735133133 730196533 735044937 739580536 738378601 737219162 737118073 738612671 736747360
2372.4 736747360 734889145 736267548 736433258 737852097 739013443 738620300 739346771 739840622 739555664
2381.1 739555664 738594208 738402557 738765640 739015274 740804901 741362076 739247055 737502441 737379379
2389.7 737379379 737929764 738791351 739534760 738677902 737794189 738336411 738664322 738577957 739165802 739460373
2399.4 739460373 739110413 739933395 740459442 739351196 739060135 739127426 738090973 738358994 739254837
2408.1G39254837j040344r71985M03137N80521l08533J4496O91681l64456q73490l48053
2417.7G37037811J167298M33960j065064k64664j436920n8899K591935k01340j837006
2426.4G36367111M46930J437912r7427p79267n24520j261673o08292J130066K81753
2435.1G36392593j649627k42386J784820L79410m62189j87606m07410K40555n3635
2443.7G35794525K14615M98810j002274j380310j51825P95746j504364j839752J188660
2452.4G32613831J109466N29938J86615m25568K00806K73590m73328m71801r9030J90201
2462.1G33634720N23453n76020o11343q7357m30679r61151j074219J570816J621704
2470.7G33609924o30951j340179m32663N00717q77151M76226N60227q78525M59290
$$ plain form
2408.1 739254837 738214493 737242508 737645645 738226166 737917633 737932129 738623810 738259354 737385864 737037811
2417.7 737037811 738205109 738639069 737574005 737309341 735872421 735813522 738405457 738204117 736367111
2426.4 736367111 736814041 738251953 738154526 737375259 736850739 735589066 734980774 736110840 736392593
2435.1 736392593 734742966 734500580 736285400 736664810 736202621 736015015 735607605 735848160 735794525
2443.7 735794525 736009140 736507950 735505676 734125366 733973541 734769287 733264923 731425171 732613831
2452.4 732613831 733723297 734253235 734439850 734014282 734215088 734488678 734015350 733543549 733444519 733634720
2462.1 733634720 734158173 733582153 732970810 732883453 732452774 731491623 730417404 731988220 733609924
2470.7 733609924 732978973 731638794 731206131 731706848 730829697 731305923 731866150 730987625 731446915
2479.4G31446915j12992r27810l99475R31854J32217j177673M62875L29666o38733
2488.1G30046844n75866p35474l40957Q26644L96500q90655k23313K83280r80072k174302
2497.7G25632629k11486J965789J412430J63956l79639M58222p42264j948624N43518
2506.4G26894531J056824j593933j593247Q32978J112365L03879J140976Q82492j156540
2515.1G27880325j009750j9913K27661q01696j991196K594J85089q12759k19727m15497
2524.7G23025131l93448k80532J218643J345215m01001o73981j255036r44061R91593
2533.4G22632523J828613L60947k39258K26440n29022j21460N28488k32696R7732M32358
2543.1G24984665o56509j362305k026825j83640J497269l43857r44977p26394J068496
$$ plain form
2479.4 731446915 731333923 730406113 730006638 730938492 731070709 729893036 730355911 730685577 730046844
2488.1 730046844 729470978 728735504 728394547 729221191 729617691 728727036 728503723 728787003 727806931 725632629
2497.7 725632629 725421143 727386932 728799362 728963318 728583679 729041901 728299637 726351013 726894531
2506.4 726894531 727951355 726357422 724764175 725597153 726709518 727013397 728154373 729036865 727880325
2515.1 727880325 726870575 726850662 727078323 726276627 724285431 724288025 724473114 723660355 723440628 723025131
2524.7 723025131 722631683 722351151 723569794 724915009 724514008 723840027 722584991 721640930 722632523
2533.4 722632523 724461136 724822083 724582825 724809265 724280243 724158783 724687271 724454575 724552307 724984665
2543.1 724984665 724328156 722965851 720939026 720755386 722252655 721908798 720963821 720237427 721305923
2551.7G21305923J630555q1787k06833q91037j110611j139527M0741J127777N07050
2560.4G21182251l96652j331101L43857O6605j003418L3111K81372M06647q7967k11258
2570.1G19283447m49753n07888M26788J151581n01709j910935l27606M62418J470337
2578.7G19096680M22287j302414n73883o29578r32236l92761J399765M2038j429291
2587.4G15700607J6403L53165L37601j31378j74637j014176j035156q02002o72455
2596.1G12577972J403580J314774P77282j87988q9950j51215k668991j063461J164093
2604.8G13076096j09253j285859k43301P71103N61371l44162p06558J42593l31421
2613.5G11530609m65622j046142q53730M79355K0142l3493k6398K44446k7542m38233
$$ plain form
2551.7 721305923 722936478 722854691 722647858 721756821 720646210 719506683 719547424 720675201 721182251
2560.4 721182251 720785599 719454498 719798355 719864960 718861542 718894653 719176025 719582672 719494705 719283447
2570.1 719283447 718833694 718325806 718752594 719904175 719402466 717491531 717163925 717626343 719096680
2578.7 719096680 719518967 718216553 717642670 717013092 716080856 715688095 717087860 717129898 715700607
2587.4 715700607 715717010 716070175 716407776 716276398 716101761 715087585 714052429 713250427 712577972
2596.1 712577972 713981552 715296326 716073608 715885620 715795670 715644455 712975464 711912003 713076096
2604.8 713076096 712966843 711680984 711437683 712208786 712770157 712425995 711719437 711862030 711530609
2613.5 711530609 711064987 710018845 709165115 709644470 709664612 709631119 709604721 709849167 709821625 709383392
2623.1G09383392j097717q91266P72171n72204r06525Q13217J245422n11016j265183
2631.8G06970291l23868j151580M730Q64563k85874j150894p63702J55411n8594N41000
2641.4G04801483m14581j109848q58383K72140J608048k96479l96347k40860q09021
2650.1G02556152j178207k099304m28467J086044P15103n04455q34198j27182l11585
2658.8F98873901q39462p15256m15420L05557O52466k69241Q60214L36685j622696
2667.5F97166748m81186P01981J193618p5759p79648j289444k198105o06003M99878
2676.1F94132080L59573o52771l90930N23453L24173o53763j775513P76825K213974
2684.8F94857101m88891j830902k80075L81j710129k81601J543885L86810p08237o15158
$$ plain form
2623.1 709383392 708285675 707394409 708166580 707594376 706687851 707501068 708746490 708235474 706970291
2631.8 706970291 706646423 705494843 705499573 706364136 706078262 704927368 704163666 704319077 704260483 704801483
2641.4 704801483 704386902 703277054 702418671 702690811 704298859 704002380 703606033 703365173 702556152
2650.1 702556152 701377945 699278641 698850174 699936218 700651321 700146866 699312668 699185486 698873901
2658.8 698873901 698034439 697319183 696903763 697209320 697861786 697592545 698452759 698789444 697166748
2667.5 697166748 696685562 697387543 698581161 698505402 697725754 696436310 694238205 693632202 694132080
2676.1 694132080 694491653 693838882 693447952 693971405 694295578 693641815 691866302 692643127 694857101
2684.8 694857101 694368210 692537308 692257233 692257614 690547485 690265884 691809769 692196579 691488342 690873184
2694.5F90873184l44238k46887m87976n31311N70144K80381j692887j214218M59061
2703.1F87665253r05991q59909J178055m90341j010514J215821K72216j732559K2431
2711.8F85354462P62100q39386J46332p935j652527r21478Q30154P5150o28738J32064
2721.5F83250198j486969p74917K97775K45743J115265j025772k16675J205826j195069
2730.2F81415405j346359j108475j471176m33044K33917Q66623K72827j489563o866
2738.8F76933289J349792J51062j120834j305008n9891l41110K02713J445617r918
2747.5F77245712j439361q92563Q4228r05609j453476l06854J002121O15311r90448
2756.2F72959061p48902n49392o39573q3923M63867K40784l23486l43933q13981o93054
$$ plain form
2694.5 690873184 690528946 690282059 689794083 689262772 689832916 690113297 688420410 687206192 687665253
2703.1 687665253 686759262 685899353 687077408 686587067 685576553 686792374 687064590 685332031 685354462
2711.8 685354462 686116562 685277176 685423508 685415573 683763046 682841568 683671722 683746872 683118134 683250198
2721.5 683250198 681763229 680988312 681286087 681531830 682647095 681621323 681404648 682610474 681415405
2730.2 681415405 680069046 678960571 677489395 677056351 677290268 678156891 678429718 676940155 676933289
2738.8 676933289 678283081 678434143 677313309 676008301 675948410 675607300 675810013 677255630 677245712
2747.5 677245712 675806351 674913788 674998016 674092407 672638931 672332077 673334198 673949509 672959061
2756.2 672959061 672210159 671660767 671021194 670937271 671401138 671641922 671318436 670974503 670160522 669467468
2765.8F69467468o39648j068802o25839j95160k87934N41840k39792j600647P71713
2774.5F66123199M48914j069565o79779q12607J09635l26615M4709r6283j488800j285553
2784.2F60967255q62122J182251R42612j216278j583481j752396r79233J087189Q67767
2792.8F58653564j605072j145706j41220k41775N7068j96686j156388j492996N69153
2801.5F53299942J103134r61914k883072j785202Q29239L19443j37024m15878j681672
2810.2F47686996j406936k00195K54821O83136n16510k681122j177825j26877l41034
2818.9F42174454p84073q95691P09152m67224r26437L86276q30002l095894k353859
2827.6F33916702l77464M25377J658020p95441j870575o09398p44133j0872j853218
$$ plain form
2765.8 669467468 668827820 667759018 667133179 666938019 666650085 667191925 666952133 665351486 666123199
2774.5 666123199 666572113 665502548 664822769 664010162 664119797 663793182 663837891 663741608 662252808 660967255
2784.2 660967255 660105133 661287384 662229996 661013718 659430237 657677841 656698608 657785797 658653564
2792.8 658653564 657048492 655902786 655761566 655519791 655576859 655380173 654223785 652730789 653299942
2801.5 653299942 654403076 653441162 650558090 648772888 649602127 649921570 649784546 649368668 647686996
2810.2 647686996 646280060 646079865 646334686 647017822 646501312 643820190 642642365 642515488 642174454
2818.9 642174454 641390381 640494690 641203842 640736618 639810181 640196457 639366455 636270561 633916702
2827.6 633916702 633539238 633964615 635622635 634827194 632956619 632347221 631603088 631592216 629738998
2836.2F29738998j496887p17010j759644j389389k674866k539939k117348j488304
2843.9F15555611p01828k330780k970200k505684j546211o40144r28536k180176k246628
2852.6E99505424r94186r0027R17206N07050j113243q34160L27072q34084n68542P4768
2862.3E96897278k279396j968460O00433J405258q21724k463951j559524j565628j567154
2870.9E86677132j465531r35020j119347j248627p743p9956J172981P00493j722107
2879.6E81972275j023140r08318o69861L25509o64940k115059k560044j080207N04264
2888.3E73780479L44773o54450j389732o09779l72277j707763j758423m82483l85246
2897E66765099j417962q77265j07346r64623j417198m15916L58162r85146j521911
$$ plain form
2836.2 629738998 628242111 627525101 625765457 624376068 621701202 619161263 617043915 615555611
2843.9 615555611 614853783 612523003 609552803 607047119 605500908 604860764 603932228 601752052 599505424
2852.6 599505424 598511238 598421211 599338417 599845467 598732224 597898064 598225136 597391052 596822510 596897278
2862.3 596897278 594617882 592649422 593249855 594655113 593833389 591369438 589809914 588244286 586677132
2870.9 586677132 585211601 584276581 583157234 581908607 581900864 581820908 582993889 583694382 581972275
2879.6 581972275 580949135 580040817 579370956 579696465 579031525 576916466 574356422 573276215 573780479
2888.3 573780479 574125252 573470802 572081070 571471291 571099014 569391251 567632828 567150345 566765099
2897 566765099 565347137 564469872 564362526 563397903 561980705 561564789 561922951 560937805 559415894
2905.7E59415894o18248l04451J73072r47914k566261j256294L42712k95563j477317
2914.3E52465630k875100j492805J251678j185531k703743r70688k48261k87666q93288
2923E43060226l70483o36253p45430n24903n75180J713639J705589m91066j411858
2931.7E41724281n16052J174126M06227j27144P1983r09691O46859K164077L98751
2940.4E45033417q39q6709M58870J974526L90625m00772l34435n65834l30925j361542
2950E44776382o54525J187210L76930k688789k503243N21164N67474j93824J16844
2958.7E41505623J301765J439591L48472P07703j12801p94143L35235J71814M04625
2967.4E45307884J318016n7144m41933J844712K584648J886673J047287K94494J193505
$$ plain form
2905.7 559415894 558797646 558493195 558666267 557718353 555152092 553895798 554238510 553942947 552465630
2914.3 552465630 549590530 548097725 549349403 548163872 545460129 544489441 544241180 543953514 543060226
2923 543060226 542689743 542053490 541308060 540783157 540207977 541921616 543627205 543136139 541724281
2931.7 541724281 541208229 542382355 542788582 542661438 542733421 541823730 542470589 544634666 545033417
2940.4 545033417 545032578 544945869 545404739 547379265 547769890 547369118 547034683 546468849 546137924 544776382
2950 544776382 544121857 545309067 545685997 542997208 540493965 541015129 541582603 541388779 541505623
2958.7 541505623 542807388 544246979 544595451 545303154 545190353 544396210 544731445 544903259 545307884
2967.4 545307884 546625900 546568756 546126823 547971535 550556183 552442856 553490143 553784637 554978142
2976.1E54978142J568718P35702J263314K71263r32503J674843K234802K86102L76015
2984.7E62456398O09360K37121M28887J466636J805001P46917k59132n19257Q36945
2993.4E67808876J270523j37596L09639R27811Q18176N78461l44O05393o90651j239777
3003.1E70250511q9722q86077O06880J323051Q16307l6506k986298m02336K225265
3011.7E70821075k54325j158143j052742o23130R3765l59345j231498j92681J330796
3020.4E67373772m89235j934815j17454Q38012m28237r66950p02972j278038j148758
3029.1E61145325j6938J9722o68945j045952m74777P96280P2670q90923k02598N0888
3038.7E58784752p50771k161102j307030q11310k360763j106072m78897p18078R37347
$$ plain form
2976.1 554978142 556546860 557282562 558545876 558817139 557884636 559559479 561794281 562080383 562456398
2984.7 562456398 563065758 563302879 563731766 565198402 567003403 567750320 567491188 566971931 567808876
2993.4 567808876 569079399 568941803 569251442 570179253 570997429 571575890 571575546 572180939 571490288 570250511
3003.1 570250511 570160789 569274712 569881592 571204643 572020950 571984444 568998146 568595810 570821075
3011.7 570821075 570566750 569408607 568355865 567732735 567826500 567467155 566235657 566042976 567373772
3020.4 567373772 566884537 564949722 564832268 565670280 565242043 564275093 563572121 562294083 561145325
3029.1 561145325 561128387 561148109 560479164 559433212 558958435 559754715 559827385 558936462 558733864 558784752
3038.7 558784752 558033981 555872879 554565849 553754539 551393776 550287704 549808807 549090729 550028076
3047.4E50028076J42784j547012j83220R96361q17070j708527l07426j92185j281089
3056.1E45130692j559716l5858K54936j965370k113075n71556o485L86162N70335n34554
3065.7E39555511j749115o00891n0583j452980j088714k52800Q74557Q94928k153282
3074.4E33976631j927261Q49075O52428j486817k086105m29420l8872k81258j055908
3083.1E28172493p85904J285553j417198l100472m33082L67164R04389k55509k366218
3091.8E22371216j379280O60324M32014j289825r28764r4910j62277m89006m89808
3100.5E18629684m78630j863517j181832J98479k66724j189956k570992j667061k97394
3109.1E09312057k31475N06096L8070k80456p0877j284867j537552n10788k81066m40255
$$ plain form
3047.4 550028076 550170860 548623848 548440628 549436989 548619919 546911392 546603966 546411781 545130692
3056.1 545130692 543570976 543535118 543790054 541824684 539711609 539140053 539133568 539519730 540090065 539555511
3065.7 539555511 537806396 537205505 537154922 535701942 534613228 534360428 535234985 536129913 533976631
3074.4 533976631 532049370 532898445 533550873 532064056 529977951 529548531 529509659 529228401 528172493
3083.1 528172493 527386589 528672142 527254944 524154472 523721390 524088554 524992943 524737434 522371216
3091.8 522371216 520991936 521652260 522084274 520794449 519865685 519770775 519608498 519119492 518629684
3100.5 518629684 518151054 516287537 515105705 515304184 515037460 513847504 511276512 509609451 509312057
3109.1 509312057 509080582 509586678 509624748 509344292 509273415 507988548 506450996 505940208 505659142 505218887
3118.8E05218887o77337j301117j276245j207581j197128K97661o17295l188476j555138
3127.5D94496231K37732M6654L08761m03556j763573k153359j050338q60443j021233
3136.1D87836876K4185j674805k646370N77546J167030j529655k371560j589203j359939
3144.8D78434105j350250p79496l17459k93770m11148r95254j249848p02629k91252
3153.5D72042999J8730n01709p22999k45361j953164l234939j885567j65558r079r66148
3163.1D62377205o22940k015419l200264m36554L00712l3988n9281k118225k289619
3171.8D51901627m87099n44777k064323j134568M31786n1460p75872k445449k337838
3180.5D42492027l90510o66313j085282k73056m68445j638755j772957q44193j8539
$$ plain form
3118.8 505218887 504541550 503240433 501964188 500756607 499559479 499857140 499239845 496051369 494496231
3127.5 494496231 494733963 494780617 495089378 494685822 492922249 490768890 489718552 488858109 487836876
3136.1 487836876 487861061 486186256 483539886 484117432 485284462 483754807 481383247 479794044 478434105
3144.8 478434105 477083855 476304359 475986900 475693130 475281982 474286728 473036880 472334251 472042999
3153.5 472042999 472061729 471560020 470837021 470591660 468638496 465403557 463517990 463352432 463343353 462377205
3163.1 462377205 461754265 459738846 456538582 456102028 456402740 456368752 456309471 454191246 451901627
3171.8 451901627 451414528 450869751 448805428 447670860 448102646 448051186 447275314 444829865 442492027
3180.5 442492027 442101517 441435204 440349922 440076866 439608421 437969666 436196709 435352516 435333977
3189.2D35333977p22122k048417j677475r20753j157608j447411p96508n76821j198578
3197.9D24788284j187210q2397M18892p38907J2703j73455k578239j736679J05781
3206.5D18828773m87442k192192o48269K37655k256240n31769J140899j101913k199783
3215.2D10789719j485329q39462l02658l83606r78012m04778r27162j143761q87070
3223.9D03437881k067222j313782m1809M9820j045113q77037J66169r59206r55925
3232.6C96393776j234245r58481O16836N5657o79779j677246k118454q60749n05409
3241.3C89031906j218185l66745L76510k089615k330665N02586O56739n64499j341210
3249.9C82656822j302719P7591j44806j038513k79732l55110j069908j167297m85497
$$ plain form
3189.2 435333977 434611855 432563438 430885963 429965210 428807602 427360191 426563683 425986862 424788284
3197.9 424788284 423601074 423518677 423937569 423198662 423211365 423037910 420459671 418722992 418828773
3206.5 418828773 418341331 416149139 415500870 415738525 413482285 412950516 414091415 412989502 410789719
3215.2 410789719 409304390 408464928 408162270 407778664 406800652 406395874 405468712 404324951 403437881
3223.9 403437881 401370659 400056877 400015068 400064888 399019775 398142738 398308907 397349701 396393776
3232.6 396393776 395159531 394201050 394817886 394873543 394193764 392516518 390398064 389537315 389031906
3241.3 389031906 387813721 387446976 387823486 385733871 383403206 383905792 384562531 383998032 382656822
3249.9 382656822 381354103 381431694 381286888 380248375 379968643 379613533 378543625 377376328 376890831
3258.6C76890831M00581P9346j254997k539177k127876l3951J118583O8894l91884
3267.3C72210350m03709r14688K822l68957j536827j502152j180763n25513n24063
3276C65256500j69067j14746q14667j054077m42009O00014n42488k078248l91769J009216
3285.6C61258659j052665j648026l13187j53694m1580P9231L95623j355706k204666
3294.3C54963989L50685M98047j146126j444015p0725L22724m23813m59442o32019
3303C51959305o13327r46961p05986p66716m5776M23088k032318q45261j17416j908875
3312.6C44399757m40635L32641J39733j12038q39310q05320r29718m09470n33371j399612
3322.3C39402657m62227k15721j371270j308746p79190j196594j572419l45115R19456
$$ plain form
3258.6 376890831 377291412 377370758 376115761 373576584 371448708 371414757 372533340 372602234 372210350
3267.3 372210350 371806641 370891953 370894775 370525818 368988991 367486839 366306076 365780563 365256500
3276 365256500 365087433 364972687 364158020 363103943 362661934 363261948 362719460 360641212 360249443 361258659
3285.6 361258659 360205994 358557968 358244781 358091087 358049507 358128738 358524361 357168655 354963989
3294.3 354963989 355314674 355812721 354666595 353222580 353151855 353474579 353050766 352591324 351959305
3303 351959305 351345978 350399017 349693031 348926315 348880539 349303627 347271309 346426048 346308632 344399757
3312.6 344399757 343959122 344291763 344431496 344319458 343480148 342674828 341745110 341335640 340802269 339402657
3322.3 339402657 338940430 338724709 337353439 336044693 335265503 334068909 332496490 332151375 333070831
3330.9C33070831M23127j307145k234039j044846r8991q3504K2812M4022q25386j770668
3340.6C26196213j237869k25373m9667k078705k410851m11872o4927j05590p96109
3349.3C18815250j027488j087914q87451n7030o82258m29306r83754j047840N50957
3357.9C13163166l33061j647358j154041j60923j077614j466542j51786k57607r70096
3366.6C05944138l55339k85016k292957k291164o61850K21996m70657j842804p39594
3375.3B97226753K17400J1577j565132r23958J593304j33667j057663n62401k9773
3384B94776440Q8291j140957j010399j060734O8417L20873j048126m06742n48268j214962
3393.6B88823833m53987L86753N95398J64166o08654p23267j219825n23987J244163
$$ plain form
3330.9 333070831 333493958 332186813 329952774 328907928 328808937 328725433 328748245 328792267 327966881 326196213
3340.6 326196213 324958344 324732971 324683304 322604599 320193748 319781876 319716949 319611359 318815250
3349.3 318815250 317787762 316699848 315812397 315755367 315073109 314643803 313660049 312612209 313163166
3357.9 313163166 312830105 311182747 310028706 309867783 308790169 307323627 307171841 306914234 305944138
3366.6 305944138 305588799 305303783 303010826 300719662 300057812 300279808 299809151 297966347 297226753
3375.3 297226753 297444153 297455730 295890598 294966640 296559944 296426277 295368614 294806213 294776440
3384 294776440 294864731 293723774 292713375 291652641 291721058 292041931 290993805 290587063 290038795 288823833
3393.6 288823833 288369846 288756599 289351997 289516163 288907509 288184242 286964417 286440430 287684593
3402.3B87684593o74648j324596j6366p68909p50103n63869q4572K04944j080665O0577
3412B82686386J968765n38902j461601K26707L35503J504841m88167k110767J061287
3420.6B83184052J057624r49039j494370j04103R85585J84993K59991L319j416607
3429.3B81711445j105232J972599J816444j044521m57020Q83503P79343J82380L3302
3438B84772243j65748j52283R34906J372814j10874j221981J227646J392651j164418
3446.7B86884956n4874R06506J89533j25485J224137K293014j80912p10831l17974
3455.3B90108070o63662K592526L281174p32251j118850R32407L65067L36456P48596
3464B95849533M51813J128559J054935J450634O57158o29215J317139P88803n85041
$$ plain form
3402.3 287684593 287009945 285685349 285668983 284900074 284149971 283586102 283501530 283706474 282625809 282686386
3412 282686386 284655151 284116249 282654648 282881355 283216858 284721699 284233532 282122765 283184052
3420.6 283184052 284241676 283292637 281798267 281694164 282679749 282864742 283124733 283128052 281711445
3429.3 281711445 280606213 282578812 284395256 283350735 282893715 283777218 284556561 284738941 284772243
3438 284772243 284606495 284454212 285389118 286761932 286651058 285429077 286656723 288049374 286884956
3446.7 286884956 286830082 287736588 287926121 287800636 289024773 291317787 291136875 290426044 290108070
3455.3 290108070 289444408 292036934 295318108 294585857 293467007 294399414 294764481 295100937 295849533
3464 295849533 296301346 297429905 298484840 299935474 300592632 299963417 301280556 302069359 301484318
3472.7C01484318J095371J626034N86471L66936Q81367L41434M42753J259022J266174
3481.4C09349880J004467P553J23425N83000J86367Q45776J620006R40590Q08697N42583
3491C16012344n21240K59895J568261J705608P46937J275558Q05588j194000J167679
3499.7C21826630J949081J541557J630021m15268N61447R956R6397J454316J022453
3508.4C29676590J320190O82412M34150P25022J630287J221390Q31794J004601n78499
3517.1C36947937J011887J600952O52847Q94814J690101L384171N45311p16248J068688
3525.7C47080460J962089J592140N6572J477890J274910K14272J468048J752090R09462
3534.4C57787933R34182J719551Q37555L21350J623840K476654J560783P02477K63863
$$ plain form
3472.7 301484318 302579689 304205723 304792194 305159130 306040497 306381931 306824684 308083706 309349880
3481.4 309349880 310354347 310361900 310485325 311068325 311254692 312100468 313720474 314661064 315469761 316012344
3491 316012344 315491104 315750999 317319260 319024868 319771805 321047363 321852951 320658951 321826630
3499.7 321826630 323775711 325317268 326947289 326532021 327093468 327103424 327199821 328654137 329676590
3508.4 329676590 330996780 331679192 332113342 332838364 334468651 335690041 336521835 337526436 336947937
3517.1 336947937 337959824 339560776 340213623 341108437 342798538 346182709 346728020 346011772 347080460
3525.7 347080460 349042549 350634689 350691261 352169151 353444061 353658333 355126381 356878471 357787933
3534.4 357787933 358722115 360441666 361279221 361600571 363224411 365701065 367261848 367964325 368228188
3543.1C68228188R87472K558708R54094N56259J143837J47477P18841K450791K387466
3551.8C80133133M54597J050187R38263R71107J550026R51958J751785J310234O34079
3560.5C89745369J716766L555260J778641m48914K715302K249069J739464J178589
3568.2D04229546n61295K037735O93817J062431L229561K488709J254196J752357K002717
3576.9D18189774J456680K624969J287194O49604K680474L275871J663590m07639K650757
3585.5D34071274L565903K049179J354866j424790J877518K475281K821273J814652
3593.2D48605156J73645L110123J557655K650681K922973P37724K840119K789650K596435
3601.9D67984161J502419J743622L166465L005982L103294J101685L961410P99446
$$ plain form
3543.1 368228188 369215660 371774368 372728462 373284721 374428558 374576035 375294876 377745667 380133133
3551.8 380133133 380587730 381637917 382576180 383547287 385097313 386049271 387801056 389111290 389745369
3560.5 389745369 391462135 395017395 396796036 396347122 399062424 401311493 403050957 404229546
3568.2 404229546 403668251 405705986 406399803 407462234 410691795 413180504 414434700 416187057 418189774
3576.9 418189774 419646454 422271423 423558617 424208221 426888695 430164566 431828156 431420517 434071274
3585.5 434071274 437637177 439686356 441041222 439616432 441493950 443969231 446790504 448605156
3593.2 448605156 448778801 451888924 453446579 456097260 459020233 459757957 462598076 465387726 467984161
3601.9 467984161 469486580 471230202 474396667 477402649 480505943 481607628 485569038 486368484
3609.6D86368484m31137O932221K210922j135139M537391J692887K932701L183136
3617.4E06291466P33719J572723M74205J744194M128037L182144J811943L770103K791710
3626E26500244K007790O998977J492424p744102L830719O339378P181702L073311m51088
3634.7E49229355J288185J939697L184357L528747L101845J300011K503090K172699
3642.4E68247986N31845K907181L759002Q891106O985779l034554K895470l64990l043900
3651.1E87774925k642708N126267N347443L658180O005897n009803J314315N135041
3658.8F06709557K220649K854958M6158J342621L40957J126404L141747K268028N918731
3667.5F25969810K184182l8338M854279p460938J77269Q966446J0555725J248169j9071617
$$ plain form
3609.6 486368484 485937347 492869568 495080490 493945351 498482742 500175629 503108330 506291466
3617.4 506291466 507025185 508597908 509072113 510816307 514944344 518126488 519938431 523708534 526500244
3626 526500244 528508034 535507011 536999435 529255333 533086052 539425430 546607132 549680443 549229355
3634.7 549229355 550517540 552457237 555641594 559170341 562272186 563572197 566075287 568247986
3642.4 568247986 568779831 571687012 575446014 584337120 591322899 588288345 591183815 590818825 587774925
3651.1 587774925 585132217 590258484 595605927 599264107 605270004 600260201 601574516 606709557
3658.8 606709557 608930206 611785164 611831322 613173943 613514900 614641304 617783051 620051079 625969810
3667.5 625969810 628153992 628115654 632969933 625508995 625686264 634652710 645208435 646456604 627384987
3676.2F27384987K663956P871208M266052j503983K08130K829056J049957P00531L50800
3684.9F45820694j45798L883057P159271m706650l193130P786255l618927k801972
3692.6F50182800L110428k12173N60760J195069R39636o22406k93427L712235J770477
3701.3F60343399o940613j360626N712280K674942J579361L10593K092361M280930
3709F68692627n603104O051712Q089295j0819321J77307J175843M90646J477585L146133
3717.7F72878723L084335l256607o60553N012513j431504m613800L678742R67788n14144
3726.3F75145493j244584O71845M050980J749420O645736J65558p632751P066421N60303
3735F87178421r872971J44806K814713j780396Q14591K104263m275665J659393R050827
$$ plain form
3676.2 627384987 630048943 637920151 642186203 640682220 640890350 643719406 644769363 645469894 645820694
3684.9 645820694 645674896 649557953 656717224 652010574 648817444 656603699 652984772 650182800
3692.6 650182800 653293228 653081055 653641815 654836884 655776520 655154114 654860687 658572922 660343399
3701.3 660343399 653402786 652042160 657754440 660429382 662008743 662319336 664411697 668692627
3709 668692627 663089523 669141235 677230530 666411209 666588516 667764359 668255005 669732590 672878723
3717.7 672878723 675963058 672706451 672045898 677058411 675626907 671013107 674691849 675659637 675145493
3726.3 675145493 673900909 674572754 678623734 680373154 687018890 687184448 679551697 686618118 687178421
3735 687178421 677305450 677450256 680264969 678484573 679299164 681403427 677127762 678787155 687837982
3743.7F87837982o572189j4805145R530181O960450P323074Q1253j2444382J0101166
3751.4F88012390n565185q813935P874298M122391J860428n749054Q11157O057053
3759.1F88609543n046311k353973L343201O24084k79083L678513p95365k528610L339081
3767.8F88591080M164428j404113r656220K376938L402023Q94776J48468k986145J289062
3776.5F86820297J446762J681748L94974o610337J698380K004623J727219L300323
3784.2F92463989l227768k750015O96640J711350N11856j595841m28543l25622J490097
3792.9F88546143N25055n94636K103425k109757k153015J984100M329834P966843k984009
3801.5F97613983j1303100J368866J438293L374939N863266p091522o644058K258682
$$ plain form
3743.7 687837982 681265793 666460648 675990829 682951279 690274353 690355606 677911224 688012390
3751.4 688012390 682447205 673633270 681507568 685629959 687490387 681741333 682552490 688609543
3759.1 688609543 683563232 681209259 684552460 685176544 684897461 688575974 687780609 685251999 688591080
3767.8 688591080 692755508 691351395 681695175 684072113 687474136 688368912 688517380 685531235 686820297
3776.5 686820297 688267059 689948807 690343781 683733444 685431824 687436447 689163666 692463989
3784.2 692463989 689236221 686486206 687182846 688894196 689406052 687810211 687381668 687056046 688546143
3792.9 688546143 689071198 688476562 690579987 688470230 686317215 688301315 692631149 700597992 697613983
3801.5 697613983 686310883 687679749 689118042 692492981 698356247 691264725 684620667 686879349
3809.3F86879349Q33435M38614P37076R56192K380676N269546m83474j1580277L336563
3817.9F88767700M836960M555054L275375j2425766l450775J770782L125916L808746
3825.7F94263992N1194n320359l20511L322602M281006K394638j0310212O61698P238159
3834.3F96262207n597839r28116Q473968m918365n504837P098617m780349l285141
3842.1F86820145P294845P16095m970703N59387l3416j135331K445679k87552J769943
3850.7F93179092O970826k87400N076142j9165573j400452R974289l694687k993774
3858.4F87658463L746719M095764J821137o383896j001358N638580l889999m853974
3866.2F86831436M270249L548660M644852l390427r012146K388458M779053L541031
$$ plain form
3809.3 686879349 687712784 688151398 688888474 689844666 692225342 697494888 697011414 685431137 688767700
3817.9 688767700 693604660 698159714 701435089 689009323 685558548 687329330 690455246 694263992
3825.7 694263992 694315186 688994827 688674316 691996918 696277924 698672562 688362350 689024048 696262207
3834.3 696262207 690664368 689736252 698210220 693291855 687787018 694885635 690105286 686820145
3842.1 686820145 694114990 694831085 689860382 690419769 690386353 689251022 691696701 691409149 693179092
3850.7 693179092 700149918 699862518 704938660 685773087 684372635 694346924 690652237 687658463
3858.4 687658463 691405182 695500946 697322083 690938187 689936829 695575409 691685410 686831436
3866.2 686831436 691101685 694650345 699295197 695904770 686892624 689281082 694060135 697601166
3873.9F97601166q354492j373597L326645n56488J408234M996185n06210q204575K161637
3882.6F90498505K063980J698990M326400r315948o60553J758575m85687M932633K327652
3891.2F97144547q018265O67648M230804k314453p09381q0490L236160M347077r700775
3899.9F88802872K542114J607666n547180N271835K01111k804413p9422R61151Q20999
3908.6F91776733o40487N38025l29743j245651l21732M14582J687927K967758l433151
3917.3F91414261n011444M352112K805862l249054j041031J153183L368683p87125
3925F93005447m033508Q79059J048584l052j42822J79291J023178j327515m48227m49295
3934.6F89731140j334381K192078J782837r96247j141968j140213J962052K378387
$$ plain form
3873.9 697601166 689246674 687873077 691199722 690643234 692051468 697047653 696541443 688336868 690498505
3882.6 690498505 692562485 694261475 698587875 689271927 688611374 690369949 689884262 694816895 697144547
3891.2 697144547 689126282 689793930 694024734 691710281 691000900 690920410 694156570 698503647 688802872
3899.9 688802872 691344986 692952652 687405472 692677307 692878418 690074005 689994583 690955734 691776733
3908.6 691776733 691136246 691674271 691344528 690098877 689777145 690191727 691879654 694847412 691414261
3917.3 691414261 686402817 690754929 693560791 690311737 689270706 690423889 693792572 693005447
3925 693005447 688971939 689850998 690899582 690896530 690753708 690932999 691956177 690628662 690180435 689731140
3934.6 689731140 688396759 690588837 692371674 691375427 690233459 689093246 691055298 693433685
3942.3F93433685l902740q92563J087723r8572J212997k229843L38745J949387r25980
3951F89972839R13849j100998k93960J497040j078644j536942O42548O30569j397934
3959.7F88248367K6322j08795J46560J312714R51843P29904p27462J96914r46274j407623
3969.3F88422470R02557M53263J48697Q0032J152649M959o73523J20087j240387J42898
3979F89513702N24750R7656Q38700J43280n33982j333389L71475J932221j021271k265930
3988.6F88267212o23322O21415J353912J22986O0119R39103n06134j394349n80978
3997.3F88259964K90604j89133M4174
4000.2F88405609
$$ plain form
3942.3 693433685 689530945 688638382 689726105 689627533 690840530 688610687 688949432 690898819 689972839
3951 689972839 690886688 689785690 689491730 690988770 689910126 688373184 689015732 689646301 688248367
3959.7 688248367 688274689 688165894 688312454 689625168 690577011 691306915 690579453 690776367 689830093 688422470
3969.3 688422470 689325027 689778290 689926987 690007019 691159668 691164627 690491104 690611191 689370804 689513702
3979 689513702 690038452 690136108 690974808 691118088 690584106 689250717 689622192 691554413 690533142 688267212
3988.6 688267212 687643890 688265305 689619217 689742203 689802322 690741425 690235291 688840942 688259964
3997.3 688259964 688550568 688361435 688405609
4000.2 688405609
##END=$$ End of the data block
