##TITLE=$$ Begin of the data block
##JCAMP-DX=5.00 $$ ACD/SpecManager v 10.08
##SPECTROMETER/DATA SYSTEM=Varian
##DATE=07 Jan 2013 10:37:16
##DATA TYPE=INFRARED SPECTRUM
##DATA CLASS=XYDATA
##ORIGIN=
##OWNER=
##NPOINTS=3735
##FIRSTX=399.26403809
##LASTX=4000.35498047
##MAXX=4000.35498047
##MINX=399.26403809
##MAXY=102.30431366
##MINY=5.55937958
##XFACTOR=1.0000000000
##YFACTOR=0.000001000000000
##FIRSTY=82.79763031
##DELTAX=0.96440572
##XUNITS=1/CM
##YUNITS=TRANSMITTANCE
##XYDATA=(X++(Y..Y))
399.3H2797630J9506684m6035691q762451N460137k57916J4379086o584500l377464
407E7125515k128006j2071453P235977L831543j4454727k392555J7297912R901795
414.7F4346001j1635567k798248M348819j4228920k0467712J3590488J4542286N171894
422.4E2869041K932023J014186l676246n611309K867344R791587N994358J277329p041302
431.1F0417011m871090k720333m574039J194286O0803k269360K222664J593868j093193
439.8D9960617R50279j629062k593556J179985M651554O390580n637165q266682l204666
448.4D1801884J469402Q360390N362976R463493M746185j6857955j3231869m359436
456.2C6755070K087837R185516K705799o146152l313747L771526P387958p1781o818889
$$ y = [82797630, 102304314, 56268623, 47506172, 52966309, 52708393, 67087479, 60502979, 57125515, 54997509, 42926056, 50162033, 53993576, 39538849, 37146294, 54444206, 64346001, 52710434, 49912186, 54261005, 40032085, 19564373, 33154861, 47697147, 52869041, 55801064, 56815250, 53139004, 47527695, 50395039, 60186626, 66180984, 67458313, 60417011, 55545921, 52825588, 48251549, 49445835, 49506638, 47237278, 49459942, 51053810, 49960617, 50910896, 49281834, 46688278, 47868263, 52519817, 58910397, 53273232, 45006550, 41801884, 43271286, 51631676, 56994652, 66458145, 71204330, 54346375, 41114506, 36755070, 38842907, 48028423, 50734222, 44588070, 41274323, 45045849, 52433807, 52362026, 45543137]
464.8D5543137L634292K455242k737209L379952M814563n015033q487740J039101J097522
473.5D5723827M436528Q560718n523987p839355J667534L943474n185757l275738N270760
482.2D7778004K159015o94133l361J930870K651508J538433Q71342m108753n112339
490.9D7010586k627644n09243j64882L298069N387371J585899r72725l796616n008884
499.6D4201931L0010K171452k691063P71221L180454l40500J332982M97200k354199
508.2D6799488Q72624K970630j04740n165623k477939K231834J487869K521065J733528
516.9E0868736k628689l832069l800297J591038M982842K703765L90648k073765k306411
525.6D5895798j312645l343647j5351M309166o80671j322338L069538J829906o34502
$$ y = [45543137, 49177429, 51632671, 48895462, 52275414, 57089977, 52074944, 43587204, 44626305, 45723827, 50160355, 58721073, 53197086, 45357731, 47025265, 50968739, 45782982, 42507244, 47778004, 49937019, 49242886, 49239525, 51170395, 53821903, 55360336, 56231678, 52122925, 47010586, 44382942, 43873699, 43708817, 47006886, 52394257, 53980156, 53007431, 49210815, 44201931, 44231941, 46403393, 43712330, 44483551, 47664005, 47323505, 48656487, 49153687, 46799488, 47672112, 50642742, 50538002, 45372379, 42894440, 45126274, 46614143, 49135208, 50868736, 48240047, 44407978, 40607681, 42198719, 47181561, 49885326, 50275974, 48202209, 45895798, 44583153, 41239506, 41224155, 45533321, 44852650, 43530312, 46599850, 48429756, 47795254]
534.3D7795254k859768j794567Q69049j96552k54609J104870J552502R74422p27882
543D6462719j088535J143150J081470j005237j794277k152699L13923K093559J603340
551.6D6657413J338471o47881k334434j124905J891949L079082k79880l321888n83740
560.3D4674187L02452j202046J943230J561420j140701j352897m40255R88427j90224
569D5143593K63782Q89759j25732q56682p23610O33023M63897k30175p81795m95056
578.6D4181004o66298R8594K680767J015492j74088O49437l56998j086270j92169J9902
588.3D6169373l87543N44922K65697q41575j381749q48491J52897J146324K656803
597D7476658r9484l474029j764271P07584Q40256k99583L37799J161564n70278k477219
$$ y = [47795254, 44935486, 43140919, 44009968, 43813416, 43558807, 44663677, 46216179, 47190601, 46462719, 45374184, 46517334, 47598804, 46593567, 44799290, 42646591, 42960514, 45054073, 46657413, 47995884, 47348003, 45013569, 43888664, 45780613, 48859695, 48579815, 45257927, 44674187, 44976639, 43774593, 45717823, 47279243, 46138542, 44785645, 44345390, 45333817, 45143593, 45407375, 46297134, 46171402, 45314720, 44591110, 45224133, 45688030, 45457855, 44676060, 44181004, 43514706, 43613300, 46294067, 47309559, 47135471, 47784908, 47427910, 46341640, 46149471, 46169373, 45781830, 46326752, 46592449, 45750874, 44369125, 43520634, 43673531, 44819855, 47476658, 47377174, 43903145, 42138874, 42846458, 43686714, 43387131, 43724930, 44886494, 44316216, 41838997]
606.6D1838997k566071q01445P62776j568585k714683o80535j766048j855433j49936
615.3C0499037N18425m41324j209536L46788J01538L13940j052280k820778j744187
624B4511623o15770K808376K436264J127137K695261J274849r7390R5505N01423Q69320
633.6C5606598p06623k347622p99927J101601Q61797k82551m33426P15565J485779
642.3C5201191J950642J298095J669152L527671K363316L97415K53292N04978L70465
651D7536217L37715P21187l65039k45285P01954J35490J284790N12432k226322m59309
660.6D7933830Q54218J79672J089603J520974O74835o54999j585335j362354Q75244
669.3D9525688J212437M24538k73125P61688N150r02180Q71517J131501l10360m94721
$$ y = [41838997, 39272926, 38471481, 39234257, 37665672, 34950989, 34270454, 32504406, 30648973, 30499037, 31017462, 30576138, 29366602, 29713390, 29814928, 30128868, 29076588, 26255810, 24511623, 23895853, 26704229, 29140493, 30267630, 32962891, 34237740, 34140350, 34235855, 34737278, 35606598, 34899975, 32552353, 31752426, 32854027, 33715824, 33433273, 32999847, 33715412, 35201191, 37151833, 38449928, 40119080, 43646751, 46010067, 46407482, 46660774, 47165752, 47536217, 47873932, 48595119, 48230080, 47984795, 48686749, 48822239, 50107029, 50619461, 48393139, 47933830, 48788048, 48967720, 50057323, 51578297, 52253132, 51598133, 50012798, 48650444, 49525688, 50738125, 51162663, 50889538, 51651226, 51656376, 50754196, 51625713, 52757214, 52446854, 51952133]
678.9E1952133l13778k00428k65663l44177N45681N99232K42664J2405n90549q9867
688.6E1547653k3212r8114O31096N69866P2288r67876j048145k04457m50084q11535
698.2D9217480n13604K73934J42872j37886L31543J29924O3130Q0089N48054Q68378
707.9E1003914M00341K9224k31849N12157n6690r84013K40567R98943L89156k8412
717.5E2273338P66743O01822k86785o09852j55296L07247n05413Q3557n6717o95347
727.2E1723297M87721J107757N90588j180245n67360N04456J91833O41205n31322n35935
736.8E2431995L53196k81319o09387m03324N81288Q56029l06072j95488J204464M87835
746.5E4119217j68324J59035j53805N41485M13941J68800J446747J304722k35382j138501
$$ y = [51952133, 51638355, 51437927, 51172264, 50828087, 51373768, 51973000, 52215664, 52228069, 51637520, 51547653, 51524441, 51426327, 52057423, 52627289, 52699577, 51731701, 50683556, 50479099, 50029015, 49217480, 48703876, 48977810, 49120682, 48982796, 49314339, 49444263, 49507393, 49587482, 50135536, 51003914, 51404255, 51433479, 51201630, 51713787, 51657097, 50673084, 50913651, 51912594, 52301750, 52273338, 53040081, 53641903, 53355118, 52745266, 52589970, 52897217, 52391804, 52475361, 52418644, 51723297, 52211018, 53318775, 53909363, 52729118, 52161758, 52666214, 52858047, 53499252, 52967930, 52431995, 52785191, 52503872, 51894485, 51491161, 52072449, 52928478, 52622406, 52426918, 53631382, 54119217, 53950893, 54109928, 53956123, 54497608, 54911549, 55080349, 56527096, 57831818, 57596436, 56457935]
756.1E6457935j307773k78084J118919O82038l97324q20251R1053J132835K04613j76621
765.7E6707340L43907K97966L5225J86370J47992l15586l61607o19831L53470J139221
775.4E7914467M17679N59646L88375j13148j77536l04539K80842Q96954L33255l9474
785F0156521K99526M02912j47495q68168O664O94081K75901k29637o72458N1174K64206
795.6F0233227J61251M5959o91196j91525N15061L72532J1104M42601R73796L7259
805.3F1910069j031788r97940l98991Q4343K42092N21126O32313k30709k1889O65966
814.9F1374592P88154M46782r61319j20068K1866q58616M09351M59000L2181n89329
824.6F1002594j93054P16957o16566r81357k25129J09845k97322p54272r44676l57410
$$ y = [56457935, 55150162, 54872078, 55990997, 56673035, 56275711, 55455460, 55546513, 56679348, 56883961, 56707340, 57051247, 57349213, 57384438, 57570808, 57718800, 57403214, 57041607, 56421776, 56775246, 57914467, 58332146, 58891792, 59280167, 59167019, 58989483, 58684944, 58965786, 59862740, 60195995, 60156521, 60456047, 60858959, 60711464, 59843296, 59849960, 60544041, 60819942, 60590305, 59917847, 59969021, 60233227, 60394478, 60440437, 59749241, 59557716, 60072777, 60445309, 60456413, 60899014, 61872810, 61910069, 60878281, 59880341, 59481350, 59565693, 59807785, 60328911, 60961224, 60730515, 60708626, 61374592, 62162746, 62609528, 61648209, 61528141, 61550007, 60691391, 61100742, 61559742, 61591923, 61002594, 60809540, 61526497, 60909931, 59928574, 59703445, 59813290, 59515968, 58761696, 57817020, 57459610]
834.2E7459610L61950o76598q51291m36737K57381Q23536k41028q26397j299637r27059
843.9E3643730J99783J49045j11863k48462J69559Q15083Q7700k77432L64418K78126
853.5E5069687P11368R60209K14333J03638L0479Q4549N09666L52688L16765O14155
863.1E8967537J87n17079J96591J157116Q77888j14357j33645j48498J7788n1636j75331
873.8F0076561N98385L50880J72275l57094q96332n56469n77053J79940L30692K4704
883.4E9346489k21462k79232m39621p61021K96597k1012l17791M5838j07521M45030
893E7986294K53403K69607L3413p02229m14344M85244N53887m92054p70008j07376
902.7E7095837Q88046M33975p12253p97837l14808K45545o58505r85141J2931K90039
$$ y = [57459610, 57821560, 57144962, 56293671, 55856934, 56114315, 56937851, 56696823, 55870426, 54570789, 53643730, 53843513, 53992558, 53880695, 53632233, 53801792, 54616875, 54704575, 54427143, 54791561, 55069687, 55781055, 56741264, 56955597, 57059235, 57089714, 57174263, 57683929, 58036617, 58353382, 58967537, 58967724, 58450645, 58647236, 59804352, 60682240, 60567883, 60434238, 60285740, 60303528, 60251892, 60076561, 60674946, 61025826, 61198101, 60841007, 59944675, 59388206, 58811153, 58991093, 59321785, 59346489, 59125027, 58845795, 58406174, 57645153, 57941750, 57920738, 57602947, 57648785, 57541264, 57986294, 58239697, 58509304, 58542717, 57840488, 57426144, 57911388, 58465275, 57973221, 57203213, 57095837, 57983883, 58417858, 57705605, 56907768, 56592960, 56838505, 56180000, 55194859, 55207790, 55497829]
912.3E5497829k21149o35780n35374m41719k70443j59573L24627j28998p57057k5528
922E2646835n27893j505657r66621J86901r697l27358L73409O42467K45694m96891
931.6E0261189l97534l73112j24302O41175P96165P80094M6296R4234L27015M56581
941.3E2507801J134014O37142L95947N15110M60842K11464o2557J61907m7291J88862
950.9E6103241P05582J72374p91523n13389L8086Q9870N12531J72730l70903k32971
960.6E5885628j8212o29078r92546k86438j19159j20098k71973l20828l25977n02235
970.2E2299084m11526k58236K12425K4010j49830j30924j5671K68963l26942k74193
979.8E1237160j87096k70821j50985k94113j74721p38213p51243L2955K68291l04722
$$ y = [55497829, 55276680, 54640900, 54105526, 53663807, 53393364, 53233791, 53558418, 53429420, 52672363, 52646835, 52118942, 50613285, 49646664, 49833565, 49823868, 49496510, 49869919, 50512386, 50758080, 50261189, 49863655, 49490543, 49366241, 50007416, 50803581, 51583675, 51629971, 51724205, 52051220, 52507801, 53641815, 54278957, 54674904, 55190014, 55650856, 55862320, 55799763, 55961670, 55914379, 56103241, 56808823, 56981197, 56189674, 55676285, 55714371, 55804241, 56316772, 56489502, 56118599, 55885628, 55867416, 55238338, 54245792, 53959354, 53840195, 53720097, 53448124, 53127296, 52801319, 52299084, 51887558, 51629322, 51841747, 51865757, 51715927, 51585003, 51569332, 51838295, 51511353, 51237160, 51050064, 50779243, 50628258, 50334145, 50159424, 49421211, 48669968, 48702923, 48971214, 48666492]
989.5D8666492q22071l64059r47315j667431j737469k489082j975571M5838J730888
998.2D0440220J921245J086503Q21773K95975R7442J22235l32363O5521L1765k26154
1007.8D4324162L8005l71288k75898o5758m93446k24567l140n58300n28625Q4404L0139
1018.4D1955688m46327l36269o2527k6859K7618n62835q99086n83054l61332J72112
1028.1C8877129k621o01006o64947n19577m61575k79560J50238l6522K9621L43575
1037.7C6834755n6358m73633j59088J86645k67536k14653J85677k28898o98692k72671
1047.4C4835548M77223M30591k8400L12180K49454o20369J888n2833k18483Q40519
1057C6227318M29035L0376p25360o63098L92906l09944p0965P57866o7764o65981K01351
$$ y = [48666492, 47844421, 47480362, 46533047, 44865616, 43128147, 40639065, 38663494, 38709332, 40440220, 42361465, 43447968, 44269741, 44565716, 44663158, 44785393, 44453030, 44518551, 44550316, 44324162, 44362167, 43990879, 43714981, 43649223, 43155777, 42931210, 42928070, 42369770, 41841145, 41925549, 41955688, 41509361, 41173092, 41110565, 41083706, 41111324, 40548489, 39649403, 39066349, 38705017, 38877129, 38874508, 38273502, 37608555, 37088978, 36627403, 36347843, 36498081, 36461559, 36491180, 36834755, 36778397, 36304764, 36145676, 36332321, 36064785, 35850132, 36035809, 35806911, 35108219, 34835548, 35312771, 35743362, 35714962, 36027142, 36276596, 35656227, 35658115, 35605282, 35386799, 36227318, 36656353, 36686729, 35961369, 35298271, 35691177, 35381233, 35310268, 36068134, 36000370, 35334389, 35535740]
1067.6C5535740J19232p2086M85763k98488m05827l30639p32479l89519J52451L9062
1077.2C4103210l23902M79122L35343n73391o54709j22360K11960k53590m26216p49783
1086.9C2025684n79294k94166l83662l43664m19233n91124j089248o73884j055141
1095.6B6596268j514521q32636r99016j039365j289277j258159r21271p13809q66143
1104.2A7162071j362646j064100r83884r76842o92705m91510o85050o48865l97801
1112.9I858668q3499n8722m59650j20665m19158k27001K20432K34130L97267K4462
1122.6I366264K42190J71411J45072O6182j39931j80897O5762Q44107R1008m67515
1132.2A0203653l24781l45951m50020l50587r119k82776O0660j76607l20880o7462
$$ y = [35535740, 35654972, 35582886, 36068649, 35770161, 35364334, 35033695, 34301216, 33911697, 34064148, 34103210, 33779308, 34258430, 34593773, 34020382, 33365673, 33243313, 33455273, 33201683, 32775467, 32025684, 31446390, 31152224, 30768562, 30424898, 30005665, 29414541, 28325293, 27651409, 26596268, 25081747, 24249111, 23250095, 22210730, 20921453, 19663294, 18742023, 18028214, 17162071, 15799425, 14735325, 13751441, 12774599, 12081894, 11590384, 10905334, 10256469, 9858668, 9775169, 9716447, 9256797, 9136132, 8716974, 8489973, 8710405, 8944535, 9341802, 9366264, 9608454, 9779865, 9924937, 9991119, 9851188, 9670291, 9736053, 10580160, 10671168, 10203653, 9878872, 9532921, 9082901, 8732314, 8723195, 8440419, 8501079, 8324472, 8003592, 7936130]
1141.9G936130l25865m06660k79202Q8996n46525m06745p3091m1628o3499l22531M49739
1152.5F009119K6449m1081M026l44821K1150J96973L92801P5532M39744K50420R4895
1163.1G125207M97270L21737J13035r3037O80867L51764L03089P26239L73299O17874
1172.7A1017344M20887O23981M20726N48597J078478O01996N62247Q32029Q48003N66765
1182.4A7521053Q34875Q18350M40413O12554P92137P58734O28960P97546N78894L35504
1192B4119020L36243O87269R30621O25379O90552N63896O02070Q14104R49474O12650
1201.6C0931278L56589Q13825N75550M52469N52895N68493L83804L69507O56734K18682
1211.3C5879826L91418O61274N22011M06524K82639M00314J31214P9716J45394J71047
$$ y = [7936130, 7610265, 7203605, 6924403, 7013399, 6466874, 6060129, 5987038, 5945410, 5881911, 5559380, 6009119, 6035568, 5994487, 5998513, 5653692, 5674842, 5871815, 6264616, 6340148, 6779892, 7030312, 7125207, 7622477, 7944214, 8057249, 7964212, 8645079, 8996843, 9299932, 10026171, 10399470, 11017344, 11438231, 12062212, 12482938, 13031535, 14110013, 14712009, 15274256, 16106285, 16954288, 17521053, 18355928, 19174278, 19614691, 20227245, 21019382, 21778116, 22407076, 23204622, 23783516, 24119020, 24455263, 25142532, 26073153, 26698532, 27389084, 27952980, 28555050, 29369154, 30318628, 30931278, 31287867, 32101692, 32677242, 33129711, 33682606, 34251099, 34634903, 35004410, 35661144, 35879826, 36271244, 36932518, 37454529, 37861053, 38143692, 38544006, 38675220, 38754936, 38900330, 39071377]
1220.9C9071377j8696k85431J47186M61960L77243j5308p0362J8875M4880K97046K00783
1231.5D0229553J96137P7678j03000J2050K3884K3419K22534K31033o1550J62502K88536
1242.2D1302776L1399M3217K44930K35218q4000r0629J62674K21943j10394j98238
1251.8D1758896M1504K37022M32686L7640j62491M2164R0953J41331J82522L33492
1261.4D3135719J27186j46496l4950N6759K27585M34185J56368J09573L48000Q2989
1271.1D4496918p2743j28612J40922M25648J94046K25040L81371L86787J52779M9271
1280.7D6251427J33365K54673M14765M56260L08190r7138O5560L87695L03375Q9394
1290.4D8567566K41714N77641K42969K10839K01130J80175L02700Q2055K99629K30129
$$ y = [39071377, 39052681, 38767250, 38914436, 39376396, 39753639, 39738331, 39667969, 39686844, 39731724, 40028770, 40229553, 40425690, 40503368, 40400368, 40412418, 40436302, 40459721, 40682255, 40913288, 40851738, 41014240, 41302776, 41334175, 41377392, 41622322, 41857540, 41773540, 41682911, 41845585, 42067528, 41957134, 41758896, 41800400, 42037422, 42470108, 42507748, 42345257, 42387421, 42478374, 42619705, 42802227, 43135719, 43262905, 43116409, 43081459, 43138218, 43365803, 43799988, 43956356, 44065929, 44413929, 44496918, 44424175, 44295563, 44436485, 44862133, 45056179, 45281219, 45662590, 46049377, 46202156, 46251427, 46384792, 46639465, 47054230, 47510490, 47818680, 47721542, 47787102, 48174797, 48478172, 48567566, 48809280, 49386921, 49629890, 49840729, 50041859, 50222034, 50524734, 50606789, 50906418, 51136547]
1300E1136547M3717L51604L09746P6797K24282R7183n4791K90955J10187P4490J96816
1310.6E2857533O877Q610p881J15498Q6567J29867J5053o8131L24154K92942J27091
1321.2E3888180j18450L2653K79637R6344J94858K48978O6246l24833j26667L41580
1330.9E4578526O8191m2614J73866J79455p8796k47238j50669k41q4465o8878J33339
1341.5E4460476M0306K90279J36795k39601j47541q8901R7961q8138p481J81599j6976
1352.1E4618778Q9741O9820q9759k92950j11103m5658k30484J19854J98356o1035l74718
1362.7E3890842l44844R0751J45375k812k09732p0702k178k8568j76552k13047j4828
1373.3E3063705k8850J26499j46099k64343p8697k3983L6716q6506j24714j92825m8367
$$ y = [51136547, 51180264, 51531868, 51841614, 51918411, 52142693, 52239876, 52185085, 52476040, 52586227, 52660717, 52857533, 52864410, 52873020, 52865139, 52980637, 53067204, 53197071, 53212124, 53143993, 53468147, 53761089, 53888180, 53769730, 53802383, 54082020, 54178364, 54373222, 54622200, 54688446, 54363613, 54236946, 54578526, 54646717, 54604103, 54777969, 54957424, 54878628, 54631390, 54480721, 54480480, 54396015, 54327137, 54460476, 54500782, 54791061, 54927856, 54688255, 54540714, 54451813, 54549774, 54461636, 54454155, 54635754, 54618778, 54708519, 54778339, 54688580, 54395630, 54284527, 54238869, 54008385, 54128239, 54326595, 54265560, 53890842, 53545998, 53636749, 53782124, 53779312, 53569580, 53498878, 53496700, 53468132, 53291580, 53078533, 53063705, 53034855, 53161354, 53015255, 52750912, 52672215, 52648232, 52684948, 52598442, 52473728, 52280903, 52232536]
1383.9E2232536K8622k15412M7424M77715J29852k7271J94160K63012q3137k19403
1393.6E2828098M4976q164k33940k1526m3183l86886j74824M4918O5750J07086m96
1404.2E2221809k53997k70455j80668O2310P6633k17533n1457l6472j18816l1563j18435
1414.8E1081356J61331L16120j05453K6272o7536l94909K1058P8350J45103J43967
1424.4E1405659P7526J56528M254k3312K79942K37384k64408j6319K17167J09245J89724
1435E2373390R6054j88938K08225L36029O8608l7739J26011J31073K09209R3880Q2035
1445.6E3497837J68152J74511O8596k21291K522K83130J27488n0576K55600L99018
1455.3E4704987M7229k14954r6039K47883J16783K22931L60291J36001O3450N7362
$$ y = [52232536, 52261158, 52045746, 52093170, 52570885, 52700737, 52673466, 52867626, 53130638, 53047501, 52828098, 52873074, 52864910, 52630970, 52609444, 52566261, 52179375, 52004551, 52049469, 52115219, 52222305, 52221809, 51967812, 51697357, 51516689, 51578999, 51655632, 51438099, 51386642, 51350170, 51231354, 51199791, 51081356, 51242687, 51558807, 51453354, 51479626, 51412090, 51017181, 51038239, 51116589, 51261692, 51405659, 51483185, 51639713, 51643967, 51620655, 51900597, 52137981, 51873573, 51857254, 52074421, 52183666, 52373390, 52469444, 52280506, 52488731, 52824760, 52893368, 52855629, 52981640, 53112713, 53321922, 53415802, 53497837, 53665989, 53840500, 53909096, 53687805, 53690327, 53973457, 54100945, 54050369, 54305969, 54704987, 54752216, 54537262, 54441223, 54689106, 54805889, 55028820, 55389111, 55525112, 55588562, 55645924]
1464.9E5645924K57305K02926P2533J02585J79390K56752L00255L49418R1332J41708
1474.6E7600128K94666M94244K19494r4849N1129J73660J47358K40478P3578Q377J80500
1485.2E9388763J75450j67229K8713M24862j7753j88092J3626q8302k16080L3035N28180
1495.8E9915173l02262n20672k12455J8776L7296j86268k44450k05852L09803N17887
1505.4E9126976j170509j801621N59799N26764j95835N429k14299m81956j25019M1710
1515.1E6271439L83869L70716q19634o71814L3989K63840j47980r5401k45369J29032
1524.7E5472687q7216k14714O5499J10279j40950l80661j87541j2253j76285k45361
1534.3E4203484Q4102r9483l4451K95120j86267o67950k71591k27242J98322M52942
$$ y = [55645924, 55903229, 56106155, 56178688, 56281273, 56460663, 56717415, 57017670, 57367088, 57458420, 57600128, 57894794, 58389038, 58608532, 58513683, 58564812, 58738472, 58885830, 59126308, 59199886, 59208263, 59388763, 59564213, 59396984, 59425697, 59850559, 59832806, 59644714, 59658340, 59570038, 59353958, 59386993, 59915173, 59612911, 59092239, 58879784, 58898560, 58935856, 58749588, 58505138, 58299286, 58609089, 59126976, 57956467, 56154846, 56714645, 57241409, 57045574, 57051003, 56836704, 56354748, 56229729, 56271439, 56655308, 57026024, 56206390, 55534576, 55568565, 55832405, 55684425, 55589024, 55343655, 55472687, 55385471, 55170757, 55236256, 55346535, 55205585, 54824924, 54637383, 54625130, 54448845, 54203484, 54287586, 54188103, 54153652, 54448772, 54262505, 53594555, 53322964, 53095722, 53294044, 53746986]
1544E3746986K64889l94695j5164J09986J37699j13945l33351K12951K94812R4192
1553.6E4004360j24000K66403J93649R8213q00121l83675J861439K8580K5509l2849
1563.3E5137508j10595J0933K28729K56554L0258J32137m10954j19583R8210j49937
1572.9E5103260L1250k1790j99401k78126Q2416j6864j3375j28692m63173k48081j40557
1583.5E3706867j16966m93790m22764j06479k30477l0624k68532l12233l84037l39374
1593.2E1001591k08817m00230l35140l34252j32973k21942k38011l83102m03458l19916
1602.8D8023750m63550k45423m11174j99440k40380k79560k35363m49600k70420l78063
1612.5D4850777k33837l05020O7059O4430q23364j54106m27132k12105k16865J0150
$$ y = [53746986, 54011875, 53617180, 53602016, 53712002, 53849701, 53735756, 53402405, 53615356, 53910168, 54004360, 53880360, 54146763, 54340412, 54438625, 53638504, 53254829, 55116268, 55144848, 55170357, 55137508, 55026913, 55037846, 55266575, 55523129, 55553387, 55685524, 55274570, 55154987, 55253197, 55103260, 55134510, 55112720, 54913319, 54635193, 54717609, 54700745, 54687370, 54558678, 54095505, 53847424, 53706867, 53589901, 53096111, 52673347, 52566868, 52336391, 52305767, 52037235, 51725002, 51340965, 51001591, 50792774, 50392544, 50057404, 49723152, 49590179, 49368237, 49130226, 48747124, 48343666, 48023750, 47560200, 47314777, 46903603, 46704163, 46463783, 46184223, 45948860, 45499260, 45228840, 44850777, 44616940, 44311920, 44378979, 44443409, 43620045, 43465939, 43038807, 42826702, 42609837, 42619987]
1622.1D2619987k46227o43566M1916k30339j05820l20415j53321k19501j91593K4669
1631.7D0575790n2162J45008o5353P2006n55702k80930j02474Q4446J76441k25174
1641.4C9771896j4755l07884J39488M00433k25029K04002k11094j51367k3159M96586
1651D0079117O66473J468373m79752r45877K24514J18652J33614R8373K77542K5303
1660.7D1666332j7097N42457K00417L94600K24087K25830K63237L56521L80875q1062
1670.3D4156197M08069J31947M43622M58496L30533J93454K08626M89025K39975L56136
1680D7416080K51515L44623M50013J92196L69926K84405O24241M3365O3439N17765
1689.6E0557568M06730M97311L55991N06874M96666N60120K38491N18768P00188M86591
$$ y = [42619987, 42373760, 41730194, 41772110, 41541771, 41435951, 41115536, 40962215, 40742714, 40551121, 40575790, 40523628, 40668636, 40603283, 40675289, 40119587, 39838657, 39736183, 39820629, 39997070, 39771896, 39757141, 39449257, 39588745, 39989178, 39764149, 39968151, 39757057, 39605690, 39582531, 40079117, 40745590, 42213963, 41734211, 40788334, 41012848, 41131500, 41265114, 41363487, 41641029, 41666332, 41649235, 42191692, 42392109, 42786709, 43010796, 43236626, 43499863, 43856384, 44237259, 44156197, 44564266, 44696213, 45139835, 45598331, 45928864, 46122318, 46330944, 46819969, 47059944, 47416080, 47667595, 48012218, 48462231, 48654427, 49024353, 49308758, 49932999, 49976364, 50039803, 50557568, 50964298, 51461609, 51817600, 52324474, 52821140, 53381260, 53619751, 54138519, 54838707, 55325298]
1699.3E5325298N03445o86432Q20438R20479P63005K47192Q5613M86984L83893P23938
1708.9E9573853N78674j17352M2672K40829L61385K03205L16464N37857L51528O03
1718.5F2089718K140L33172L96045K90505J88671j56422K4098K32532L2231P5645K67117
1729.1F3775452K02312j6373K19220M21035l57086q13083N45665M87610K01439J60797
1738.8F4826988j5472K7878M34448J62948Q1452M62517L97102J85226j716J66756L63777
1749.4F7091904N37109L07503k55852J88408K06551J73339L79563N9837o9145K74910
1759F8894127K79983L00873J19255j18515O4713R9548J98052J43417J58363J37467
1768.7G0277283R9899P1091j61972m5075m2442K74330K68829L9704O7428m4319K01874
$$ y = [55325298, 55828743, 55142311, 55962749, 56883228, 57646233, 57893425, 57979038, 58466022, 58849915, 59573853, 60152527, 60035175, 60077847, 60318676, 60680061, 60883266, 61199730, 61737587, 62089115, 62089718, 62091858, 62425030, 62821075, 63111580, 63300251, 63143829, 63167927, 63400459, 63432690, 63508335, 63775452, 63977764, 63961391, 64180611, 64601646, 64244560, 63431477, 63977142, 64464752, 64666191, 64826988, 64811516, 64839394, 65273842, 65436790, 65518242, 65980759, 66377861, 66563087, 66561371, 66728127, 67091904, 67629013, 67936516, 67680664, 67869072, 68075623, 68248962, 68628525, 68688362, 68619217, 68894127, 69174110, 69474983, 69594238, 69475723, 69540436, 69639984, 69838036, 69981453, 70139816, 70277283, 70377182, 70448273, 70286301, 70241226, 70198784, 70473114, 70741943, 70781647, 70849075, 70804756, 71006630]
1779.3G1006630K11113k09000N0881K93495J27418m1046k1873m0947O7047J00586R4002
1789.9G1638306J57257K48253j4725k34223J59134J19011P6226J22985J36673N722
1799.5G2414619j58485J24779k21733j86379J45966J61651K08168j7982k1835J96167
1809.2G2644936J86546j69281q6800J24451R4734J94359j0262L190j66230k75329K02751
1819.8G2743065J51184P7446M7531j129K24754L1853j25145N0530J39991L7880k52052
1830.4G3125908P6767L8902o5140K12761O6254j4839J10077j4145Q6494J31691K9175
1841G3783905j45996M1565J11862m36706J55166K23580o8093m5387K02530J27708j53640
1851.6G3796494n0148j9288L8033P9338Q0994Q9645q6502n6450K0920R9518Q857j20491
$$ y = [71006630, 71217743, 71008743, 71059624, 71353119, 71480537, 71439491, 71417618, 71376671, 71443718, 71544304, 71638306, 71795563, 72043816, 72029091, 71794868, 71954002, 72073013, 72149239, 72272224, 72408897, 72414619, 72256134, 72380913, 72159180, 71972801, 72118767, 72280418, 72488586, 72470604, 72448769, 72644936, 72831482, 72662201, 72575401, 72699852, 72794586, 72988945, 72978683, 72981873, 72815643, 72540314, 72743065, 72894249, 72971695, 73019226, 73018097, 73242851, 73274704, 73149559, 73200089, 73340080, 73377960, 73125908, 73202675, 73241577, 73176437, 73389198, 73455452, 73440613, 73550690, 73536545, 73623039, 73754730, 73783905, 73637909, 73679474, 73791336, 73354630, 73509796, 73733376, 73665283, 73619896, 73822426, 73950134, 73796494, 73746346, 73727058, 73765091, 73844429, 73925423, 74015068, 73928566, 73872116, 73893036, 73992554, 74001411, 73880920]
1863.2G3880920O7093K00905M6097m9652O1363j58363j07804J54274J50750M592j35780
1873.8G4114395J9821J56769J53999j03996n7991N7083j01646P2258L5736q5571j32500
1884.4G4128357L586J39305J5488J58470M9286k50443q3923J2535o8299R4880K15095
1895G4414337n7991K4460k8069l2203N9067o5934J27457J47659r9350j26678O6589
1905.6G4429344P210r3765O3606R5276k6367n0194O7459j17676k5276O4156n3750J85990
1917.2G4546013q4023k3468K34825O8093j4153k62031j21750P9086L2890l9489J9844
1927.8G4435837P3288o6170L0289M036p2281o9473n5420M7927q895m6463m769Q2634
1939.4G4350540R4101J37276O6742k24587r269P3730l4454m4228j7105J07635K0981
$$ y = [73880920, 73948013, 74148918, 74195015, 74145363, 74206726, 74048363, 73940559, 74094833, 74245583, 74250175, 74114395, 74134216, 74290985, 74444984, 74340988, 74282997, 74340080, 74238434, 74310692, 74346428, 74260857, 74128357, 74131943, 74271248, 74286736, 74445206, 74494492, 74244049, 74160126, 74172661, 74104362, 74199242, 74414337, 74356346, 74380806, 74352737, 74320534, 74379601, 74313667, 74441124, 74588783, 74489433, 74362755, 74429344, 74436554, 74342789, 74406395, 74501671, 74475304, 74425110, 74492569, 74374893, 74349617, 74413773, 74360023, 74546013, 74461990, 74438522, 74673347, 74741440, 74727287, 74465256, 74343506, 74422592, 74455482, 74415993, 74435837, 74509125, 74442955, 74473244, 74477280, 74404999, 74335526, 74280106, 74328033, 74319138, 74272675, 74267906, 74350540, 74444641, 74581917, 74648659, 74424072, 74414803, 74488533, 74454079, 74409851, 74392746, 74500381, 74521362]
1950G4521362j41494q3680n1529p1167L9124P7141j08315r9601J20780J17280M3296
1960.6G4363197l814o7429j7143l4851j358J54327J66214p2075j66252J5411O6597
1971.2G4402824l3653p5561o081p0061k8763K16645j3893k22855j16722K7504J31142
1981.8G4210526J14799J00883j66320j76926j1139j59080p2045K1141j7852k9542q636
1992.4G3805809J12389J09260K4956j61903j15067J75438J90582J26587l0441j89720
2002.1G4047890m1924o1027j05553M2656Q6700N5489q2138q3420l51j29402q9851J51779
2013.6G3790848J70784O5788K2202n1384j02333j57853j35643o3171m2976j3115P1129
2024.2G3554276J65199j106n5916K7771j16501j23711k7374O6994R9235K1561n8052
$$ y = [74521362, 74379868, 74296188, 74244659, 74173492, 74212616, 74289757, 74181442, 74081841, 74202621, 74319901, 74363197, 74359383, 74291954, 74274811, 74239960, 74238602, 74392929, 74559143, 74487068, 74320816, 74336227, 74402824, 74369171, 74293610, 74287529, 74217468, 74188705, 74405350, 74391457, 74168602, 74051880, 74079384, 74210526, 74325325, 74426208, 74259888, 74082962, 74071823, 73912743, 73840698, 73861839, 73843987, 73814445, 73805809, 73918198, 74027458, 74052414, 73890511, 73775444, 73950882, 74141464, 74268051, 74237610, 74047890, 74005966, 73944939, 73839386, 73882042, 73968742, 74024231, 73942093, 73858673, 73858322, 73728920, 73639069, 73790848, 73961632, 74027420, 74049622, 73998238, 73895905, 73738052, 73602409, 73539238, 73496262, 73483147, 73554276, 73719475, 73718369, 73662453, 73690224, 73573723, 73450012, 73422638, 73489632, 73588867, 73610428, 73552376]
2034.9G3552376j05469q2558k1057K8099J0445J25854Q1017p8636j5671j167m906o4316
2046.4G3424011K1897r0737k30819Q5166J12442O1287m9095k00256k0081O6048O8954
2057G3248817L4020o0135o0173M8195R659r7580J1718J07178o9076k04895k9450m0726
2068.6G2897552l4790J1300j44822j1253N0636j06727j32912J4832J1116n1987J01501
2079.2G2604446m1565j71409j46629r7397P1106N432J4457R4422q812j9165k4468J7952
2090.8G2298370J58051O4316p8064j35208m1832J02409o1378j8586P2235J17653K34803
2101.4G2712769M142j57638j73554Q9432J67358r4184M020M486J4450J931l6553Q7883
2113G2624542L6064m8973r2056O6147J19446j1902j3550R0851J48155j28357k16896
$$ y = [73552376, 73446907, 73364349, 73343292, 73371391, 73381836, 73507690, 73588707, 73510071, 73494400, 73493233, 73488327, 73424011, 73445908, 73355171, 73124352, 73209518, 73321960, 73383247, 73334152, 73133896, 73113815, 73179863, 73248817, 73282837, 73222702, 73162529, 73210724, 73220383, 73122803, 73134521, 73241699, 73172623, 72967728, 72938278, 72897552, 72862762, 72874062, 72729240, 72717987, 72768623, 72661896, 72528984, 72543816, 72554932, 72502945, 72604446, 72562881, 72391472, 72244843, 72147446, 72218552, 72223984, 72238441, 72332863, 72324051, 72304886, 72280418, 72298370, 72456421, 72520737, 72442673, 72307465, 72265633, 72368042, 72306664, 72288078, 72360313, 72477966, 72712769, 72716911, 72559273, 72385719, 72475151, 72642509, 72548325, 72552345, 72556831, 72571281, 72573212, 72536659, 72624542, 72660606, 72611633, 72519577, 72585724, 72705170, 72693268, 72679718, 72770569, 72918724, 72790367, 72573471]
2123.6G2573471k556N6877K831L937L9573n1246o3538Q4633q949k18399M1458J36558
2135.1G2594650q9004P8140J56921O4782n5733j73485n9738l944O0455J55136J2123
2145.8G2740303k9251J11549L1395n8151M7859J11611r6474j07788K14538Q2566p1228
2156.4G2976929j6991M2816J31928k1164m3518k6963j3908j831o4484k6786K4856J1803
2167.9G2972687j91262j4633J47476K29N1903q972j8974j70822r6817K11792Q728q5900
2179.5G2805435j3901L6301J3115j14479M890K23511K35565Q1192n0865j67915j73218
2190.1G2879631o9672O5010J28075J01631R1194n7197p6721L6461j0376M2854J16882
2200.7G3247772L273P630R7557J02325P5516o767L3195n5145j64375l4096J9676K4384
$$ y = [72573471, 72570915, 72627792, 72630623, 72634560, 72674133, 72622887, 72559349, 72643982, 72635033, 72416634, 72458092, 72594650, 72505646, 72583786, 72740707, 72805489, 72749756, 72576271, 72516533, 72512589, 72573044, 72728180, 72740303, 72711052, 72822601, 72853996, 72795845, 72843704, 72955315, 72858841, 72751053, 72965591, 73048157, 72976929, 72959938, 73002754, 73134682, 73113518, 73070000, 73043037, 73029129, 73027298, 72962814, 72936028, 72960884, 72972687, 72781425, 72766792, 72914268, 72914497, 72966400, 72957428, 72938454, 72767632, 72670815, 72882607, 72891335, 72805435, 72791534, 72827835, 72840950, 72726471, 72731361, 72954872, 73190437, 73271629, 73220764, 73052849, 72879631, 72809959, 72874969, 73003044, 73104675, 73195869, 73138672, 73061951, 73098412, 73088036, 73130890, 73247772, 73251045, 73258675, 73356232, 73458557, 73534073, 73527306, 73560501, 73505356, 73340981, 73306885, 73326561, 73350945]
2212.3G3350945K0530K50557K25228j08216p5577p4096l4722N9235M1557n5198j0682
2222.9G3589561J35712k2690k4994k2407n1102K1675k3834L0853j10214j70662Q4358
2233.5G3436256J20682M6181R7038J4465p6004l3699r1209r911R4323N8258k8069o5597
2245.1G3562714J5594J4244N829n5038M2564O9839r3925J7426k8008o7787P6179O6956
2256.7G3626587k0180l1219p889n2857O7261L0449j04042L1250J12656N7258r2048
2267.3G3617226l6911R9548r2232j06224J32507K6360j31065l6934L9039J7311n5274
2277.9G3473351J106M9423Q6174J2032j49239L1418J11236O4637M722p7781K6786K182
2289.4G3636047j091j1131n8037n4115j07185K7870J49139M9828l4775o210M6798J31089
$$ y = [73350945, 73371475, 73622032, 73847260, 73739044, 73663467, 73589371, 73554649, 73613884, 73655441, 73600243, 73589561, 73725273, 73702583, 73677589, 73655182, 73604080, 73625755, 73601921, 73632774, 73522560, 73351898, 73436256, 73556938, 73603119, 73700157, 73714622, 73638618, 73604919, 73513710, 73503799, 73598122, 73656380, 73628311, 73562714, 73578308, 73592552, 73598381, 73543343, 73585907, 73655746, 73561821, 73579247, 73551239, 73483452, 73559631, 73626587, 73606407, 73575188, 73567299, 73514442, 73581703, 73612152, 73508110, 73539360, 73652016, 73709274, 73617226, 73580315, 73679863, 73587631, 73481407, 73613914, 73640274, 73509209, 73472275, 73511314, 73528625, 73473351, 73474457, 73523880, 73610054, 73622086, 73472847, 73504265, 73615501, 73680138, 73684860, 73607079, 73633865, 73636047, 73634956, 73623825, 73565788, 73511673, 73404488, 73432358, 73581497, 73631325, 73596550, 73590340, 73637138, 73768227]
2301G3768227j8563j94885N0903P2441n3802M3480J48598J28563o3286q2695j60744
2311.6G3638237k45140j2360J00067O9184J312j80267q1589K15240N6633j09993R2568
2322.2G3543892K60399M3556l67874j89621P6362l067J63758M06341P3883l91197j5137
2332.8G3601295K77672k32399l24234l6293k6909K87163L30925j06262k6459k75062
2342.5G3469437l29033K04818J40442J91994K80563M5182j9890l2440j6510j5023M3847
2353.1G3963387L09104q2481n44853l6553O6246O6208K50672m36981n88105J96106
2362.7G3162750N02617n9784j56380M94309L59306J2780j10726j45363Q2138l4301
2372.4G4107346R0957J25771k88223j79146R7549J49338O2767N2795L4981p3570Q5640
$$ y = [73768227, 73749664, 73554779, 73605682, 73678123, 73624321, 73667801, 73816399, 73944962, 73881676, 73798981, 73638237, 73393097, 73380737, 73480804, 73549988, 73551300, 73371033, 73289444, 73504684, 73561317, 73451324, 73543892, 73804291, 73847847, 73479973, 73290352, 73366714, 73363647, 73527405, 73933746, 74007629, 73616432, 73601295, 73878967, 73646568, 73322334, 73286041, 73259132, 73546295, 73877220, 73770958, 73744499, 73469437, 73140404, 73345222, 73485664, 73677658, 73958221, 74003403, 73983513, 73951073, 73934563, 73919540, 73963387, 74272491, 74190010, 73645157, 73608604, 73674850, 73741058, 73991730, 73554749, 72966644, 73162750, 73665367, 73605583, 73449203, 73943512, 74302818, 74315598, 74204872, 74059509, 74141647, 74107346, 74198303, 74324074, 74035851, 73856705, 73954254, 74103592, 74166359, 74219154, 74254135, 74180565, 74266205]
2383G4266205J01364l1586P302M0794q7906j96892M6028J29906R0981J6395k20230
2393.6G4162361J8379J13831r4635L2654R5909N7785K594o8329l7842n2856k594L433
2405.2G4230690j10634O3530J37360p8858r0637j14K5245n317J05575J15036j42311
2415.8G4249565j38473q072K7740n1864j38924m1489J15883J90193P4768m0893j05660
2426.4G4132774q6189j900j1238M2694R2522O1310k1172n6259m9530j32286r2171K4117
2438G3902672j7853k8580N2201k838J3252J04080L8452j6113m8432n8639l1685j0002
2449.5G3896515r8122j58996L5141J02951J0688L6072J7411k1485K2309m7074r7618
2460.1G3697792q5159n8472K4994j19667m2717J57463L4798L4553K8282K0745J1482
$$ y = [74266205, 74367569, 74335983, 74343285, 74384079, 74296173, 74099281, 74145309, 74275215, 74366196, 74382591, 74162361, 74180740, 74294571, 74199936, 74232590, 74328499, 74386284, 74388878, 74320549, 74282707, 74229851, 74227257, 74230690, 74120056, 74183586, 74320946, 74242088, 74151451, 74151337, 74176582, 74171265, 74276840, 74391876, 74249565, 74111092, 74103020, 74130760, 74078896, 73939972, 73898483, 74014366, 74204559, 74279327, 74238434, 74132774, 74046585, 74044685, 74033447, 74076141, 74168663, 74229973, 74208801, 74152542, 74103012, 73970726, 73878555, 73902672, 73884819, 73856239, 73908440, 73905602, 73918854, 74022934, 74061386, 74045273, 73996841, 73938202, 73906517, 73896515, 73798393, 73639397, 73674538, 73777489, 73788177, 73824249, 73841660, 73820175, 73842484, 73795410, 73697792, 73612633, 73554161, 73579155, 73459488, 73416771, 73574234, 73609032, 73643585, 73671867, 73692612, 73704094]
2470.7G3704094r2766q5571M0397P2823n8502k5246j06895q9272J15830J3260r5055
2481.3G3393097r5467J68030J86401j44027n8922K4368o7673r6076o3241J9722J47423
2492G3413635P1038j83426q2093P668r6695j29288p0579J46751J62094j9409n5824
2502.6G3163872p0519j22497p6569L5133O2996q308N089Q4198N5694K7634N7381j3092
2514.1G3201012j44837o9603M9164N0125k5345k02331r5253J02989J33133N4047j91307
2524.7G2861794j05156J9531r0714j8005K5658K3429k7915r8107n531L0144R4825Q4580
2536.3G2794533r3064o0363L4950N4512L4767l1174o0974J0010Q8020p5386j04561
2546.9G2591270l5537p630O3645j09711n447J18446k7657Q194j022o950j19591j65466
$$ y = [73704094, 73611328, 73525757, 73566154, 73638977, 73580475, 73555229, 73448334, 73359062, 73474892, 73488152, 73393097, 73297630, 73465660, 73652061, 73508034, 73449112, 73473480, 73405807, 73309731, 73246490, 73266212, 73413635, 73484673, 73301247, 73219154, 73226822, 73130127, 73000839, 72930260, 73077011, 73239105, 73219696, 73163872, 73093353, 72970856, 72894287, 72929420, 72992416, 72984108, 72989197, 73073395, 73129089, 73156723, 73214104, 73201012, 73056175, 72986572, 73035736, 73085861, 73060516, 72858185, 72762932, 72865921, 72999054, 73053101, 72861794, 72756638, 72776169, 72685455, 72667450, 72693108, 72716537, 72688622, 72590515, 72584984, 72615128, 72709953, 72794533, 72701469, 72641106, 72676056, 72730568, 72765335, 72734161, 72673187, 72683197, 72771217, 72695831, 72591270, 72555733, 72548103, 72611748, 72502037, 72496590, 72615036, 72587379, 72595573, 72594551, 72587601, 72468010, 72302544]
2558.5G2302544K6039O7085n3032n4100O7703m8614q2520L2051O6162L7285l372R6199
2570.1G2453430n3818j80702m4349N0682L0990j07048o6467O4766J44478J5j90704
2580.7G2101273n6076Q1840K8313j12671m1252M3312L1074O4713p2479n8358O8550
2591.3G2078239l8711j31874j09680p8598N2330J38153L1967J7372M9736m8851j43570
2601.9G1816513j06270K4735J9897j55632m6402J24108n1575o5941l6201l2860M066
2612.5G1494438p4989k594k1073r6435o5430J8585M8584N5237O7597m0398P7766n5610
2624.1G1405678j59767Q5479o4186j69922r8091M532n9440p9140J13640L0204J2223
2634.7G1021210q3229j45630m1802J3367J62064l97j55373l8963k8229o6444r957L1281
$$ y = [72302544, 72328583, 72395668, 72342636, 72288536, 72356239, 72307625, 72225105, 72257156, 72323318, 72360603, 72357231, 72453430, 72399612, 72218910, 72174561, 72225243, 72256233, 72149185, 72082718, 72147484, 72291962, 72291977, 72101273, 72045197, 72127037, 72155350, 72042679, 72001427, 72044739, 72075813, 72140526, 72068047, 72009689, 72078239, 72039528, 71907654, 71797974, 71719376, 71771706, 71909859, 71941826, 71959198, 72008934, 71960083, 71816513, 71710243, 71734978, 71754875, 71599243, 71552841, 71676949, 71625374, 71559433, 71523232, 71490372, 71494438, 71419449, 71416855, 71395782, 71299347, 71233917, 71252502, 71301086, 71356323, 71423920, 71383522, 71461288, 71405678, 71245911, 71331390, 71267204, 71097282, 70999191, 71003723, 70944283, 70865143, 70978783, 71008987, 71021210, 70937981, 70792351, 70750549, 70763916, 70925980, 70925583, 70770210, 70731247, 70703018, 70636574, 70626617, 70657898]
2646.3G0657898n5244r9221K7153J25336o5086k19544j13350J08360J27068p3357j02134
2656.9G0317879p3593O6032P5508j05774r1606M7775R5124j24024o1661J2795q7288
2667.5G0071167Q3122N2704j4473r0927j65596o6139m8912j6014r2713j16104J6281
2678.1F9612396L2562M8157J04508k892j27838k8290J1666k1042k350J1940q522o8138
2689.6F9562157N0102N4306j31561q6876j2383O0799K2766k40517j59446M1023P0587
2700.3F9230957J0613j63384m4403O4606k1691m4899n2932K1339j2947k0897P9498
2710.9F9045860N0034r3392j43722k2591j4549o2180k6588K2713l4043o5605k5162
2721.5F8630775m4624N2445J2382r0019m3533k8183K9106L4454p1693j07972m1084
$$ y = [70657898, 70602654, 70503433, 70530586, 70655922, 70590836, 70371292, 70257942, 70366302, 70493370, 70420013, 70317879, 70244286, 70310318, 70385826, 70280052, 70188446, 70236221, 70331345, 70207321, 70145660, 70158455, 70071167, 70154289, 70206993, 70192520, 70101593, 69935997, 69869858, 69820946, 69804932, 69712219, 69596115, 69612396, 69644958, 69693115, 69797623, 69794731, 69666893, 69638603, 69650269, 69629227, 69626877, 69638817, 69630295, 69562157, 69612259, 69666565, 69535004, 69448128, 69435745, 69496544, 69519310, 69278793, 69119347, 69160370, 69230957, 69241570, 69078186, 69033783, 69098389, 69076698, 69031799, 68978867, 69000206, 68987259, 68966362, 69045860, 69095894, 69002502, 68858780, 68836189, 68821640, 68759460, 68732872, 68755585, 68721542, 68655937, 68630775, 68586151, 68638596, 68650978, 68560959, 68517426, 68489243, 68518349, 68552803, 68481110, 68373138, 68332054]
2732.1F8332054o9061L1868M6501j55579n073M3617o3476l0106m9347q6067m2870P0847
2743.7F8023308j320m0001k6634p9872o8100j9059J9005q9554o2736N737P8247J40236
2755.2F7879257o7093j28814j03394o8466J4892L9254j0842j34651o5513q3909j40281
2765.8F7130440L5782N8952l2372k0393k548m2236p5318j2047J8334o7398m3511n5450
2777.4F6892235j09955j8089j839j8471q5724r2796L6316Q057o2363p8125r2110j03950
2789F6273186q1085J1512R8572K968j75713j26373R54k671o3881p797m8767k42851
2800.5F5638054j36589R6603R2377r3414j97976j51855p439J19179o325j38755j39374
2811.2F5074486j45394q0070P9491N1048q7517q8020j86180j32538J6845j6799L9016
$$ y = [68332054, 68262993, 68294861, 68341362, 68185783, 68180710, 68224327, 68160851, 68130745, 68081398, 67995331, 67952461, 68023308, 68021988, 67981987, 67955353, 67875481, 67807381, 67788322, 67807327, 67717773, 67655037, 67660774, 67739021, 67879257, 67812164, 67683350, 67579956, 67511490, 67526382, 67565636, 67554794, 67420143, 67354630, 67270721, 67130440, 67166222, 67225174, 67192802, 67172409, 67169861, 67127625, 67052307, 67040260, 67058594, 66991196, 66947685, 66892235, 66782280, 66764191, 66762352, 66743881, 66658157, 66565361, 66601677, 66609734, 66547371, 66469246, 66377136, 66273186, 66192101, 66203613, 66302185, 66305153, 66129440, 66003067, 66004021, 66001350, 65937469, 65929672, 65880905, 65638054, 65501465, 65598068, 65690445, 65597031, 65399055, 65247200, 65239761, 65358940, 65352615, 65213860, 65074486, 64929092, 64849022, 64928513, 64979561, 64892044, 64804024, 64617844, 64485306, 64502151, 64485352, 64524368]
2821.8F4524368J8708j12084j52405j40922j15982j8349k1660j44691r0840o1268r3147
2832.4F3591728j07128j35235j38511j27602J9035k5665j66172n0602j65478l15441
2842F2378929j53858j75163k52636j59535j75503k47234k53769j97086j73443j71020
2851.7F0419682j54324j56986m9473O1142J08028K5502j40473p1487K8412l3104q8463
2862.3E9948456j41461j55212m2366O6101O2317o3759j76590k82467l05176m1626k4787
2872.9E8843430j55629j08650j55838m7111J09203L5740j81633j58539O0562l0968
2882.5E8210567r0709k4082j27255j72462J8852O9981n4570p4424j69289j67679o1378
2893.1E7357552m8790j33500j33464p1373j91960q7478l945r1995p6859q0165j16883
$$ y = [64524368, 64543076, 64430992, 64278587, 64137665, 64021683, 64003334, 63981674, 63836983, 63746143, 63684875, 63591728, 63484600, 63349365, 63210854, 63083252, 63102287, 63076622, 62910450, 62859848, 62694370, 62378929, 62225071, 62049908, 61797272, 61637737, 61462234, 61215000, 60961231, 60764145, 60590702, 60419682, 60265358, 60108372, 60058899, 60120041, 60228069, 60253571, 60113098, 60041611, 60070023, 60036919, 59948456, 59806995, 59651783, 59609417, 59675518, 59737835, 59674076, 59497486, 59215019, 58909843, 58868217, 58843430, 58687801, 58579151, 58423313, 58376202, 58485405, 58521145, 58339512, 58180973, 58241535, 58210567, 58119858, 58095776, 57968521, 57796059, 57814911, 57884892, 57830322, 57755898, 57586609, 57418930, 57357552, 57308762, 57175262, 57041798, 56970425, 56778465, 56690987, 56687042, 56595047, 56518188, 56438023, 56321140]
2903.7E6321140k27375k8148J45961Q206o8871j20788q7323q7490o6120p1499j54789
2914.3E5562904k01572r3945R9163p8338k72640k45789q7231l5183j43558l5133n147
2925E4463531k0618m1336K4857J42749K148n8712p1232J8231J43409N8281K186m3419
2936.5E4620075l6278R6909O9485L9226J86970Q6174L250L6087q3946m3572O787j03504
2948.1E4877663j58799K71O03q1680N9177k5394q8211q1879r834J17035J2092O1218
2959.7E4682262q964l1403J55155k4787m4011J70487M5631r7099R8358K22687j0052
2970.3E5158264m120K90703J93421K6092n0568n7418K13955J27277R0355K21542K0127
2980.9E6229630J22276J86859J9508K6097N9387J37298K00299J31706l5622J881J55220
$$ y = [56321140, 56093765, 56065617, 56211578, 56219784, 56150913, 56030125, 55942802, 55855312, 55789192, 55717693, 55562904, 55361332, 55267387, 55366550, 55288212, 55015572, 54769783, 54682552, 54647369, 54503811, 54468678, 54463531, 54442913, 54401577, 54426434, 54569183, 54571331, 54512619, 54441387, 54459618, 54603027, 54661308, 54663494, 54620075, 54583797, 54680706, 54750191, 54789417, 54976387, 55062561, 55065811, 55101898, 55017952, 54974380, 54981167, 54877663, 54718864, 54719135, 54719738, 54638058, 54697235, 54671841, 54583630, 54501751, 54491917, 54608952, 54621044, 54682262, 54673298, 54641895, 54797050, 54772263, 54728252, 54898739, 54944370, 54847271, 54945629, 55168316, 55158264, 55154144, 55444847, 55638268, 55664360, 55613792, 55556374, 55770329, 55897606, 55987961, 56209503, 56229630, 56351906, 56538765, 56558273, 56584370, 56643757, 56781055, 56981354, 57113060, 57077438, 57079319, 57234539]
2991.5E7234539O3206l8029m3640n3227Q5400J91475J0475j36608O8005K36484o6688
3002.1E7551392j58982K9942R300P9819K1580m582J4786j18302l2245N5321N1433r5741
3013.7E7403721o4510J8497j01421n1365j98822j32634J05294L5972P14r5585j37180
3024.3E6782681q2177N3379K831j34216q7559j35189M4182M4548j34816J0250M1188
3034.9E6405102k2927j35536o7821M6367j02054o9309l8796j94607k00046p2037j4858
3045.5E5533478N386K3148j8311n1369p2589j07418j62133o7619M8359r7668j58832
3056.1E4874432o3931j4339k0336m6868l6270j12606p4741M394j62765j59100O054
3066.7E4193924j5205j23375p7843M8096J6193P793J5904n6168n2253m8233n6900j05443
$$ y = [57234539, 57297745, 57259716, 57216076, 57162849, 57248249, 57439724, 57450199, 57313591, 57381596, 57618080, 57551392, 57392410, 57422352, 57431652, 57511471, 57533051, 57528469, 57543255, 57424953, 57392708, 57448029, 57499462, 57403721, 57339211, 57357708, 57256287, 57204922, 57006100, 56873466, 56978760, 57014732, 57015446, 56919861, 56782681, 56700504, 56753883, 56756714, 56622498, 56534939, 56399750, 56443932, 56488480, 56353664, 56363914, 56405102, 56382175, 56246639, 56178818, 56225185, 56123131, 56053822, 56015026, 55820419, 55620373, 55548336, 55533478, 55538864, 55562012, 55543701, 55492332, 55419743, 55312325, 55150192, 55082573, 55130932, 55033264, 54874432, 54810501, 54796162, 54775826, 54728958, 54692688, 54580082, 54505341, 54509735, 54346970, 54187870, 54193924, 54178719, 54055344, 53977501, 54025597, 54041790, 54049583, 54065487, 54009319, 53957066, 53908833, 53851933, 53746490]
3078.3E3746490j27452l5256m0184j22227j36219n0705K0192k9770j24813j49472j9523
3088.9E2931061N0026k6261q5510j22909r5555m1343k3430m6036m6810o8497j11786
3099.5E2312950k3571r8026j41426k7367r7546j7456o420j02928n7297r4356J1654
3110.1E1658211n7064k00302M7248N2903k30004k55283r1679q0211k1794P5314j24455
3120.7E0772884j83883n1117j45935k02423m7509j5049o6272l464j8303p8041j03413
3131.3D9857475j66095j87951r3368j8036m9061l7220j57291l06942n5115J29490l9280
3141.9D8876606j43551j67858j31920k6794q1608j41831o9286o1993q5067o1730j12571
3152.5D7792397j90510j72982j42009l1224J3211j45378j38058p1545j09108j52530
$$ y = [53746490, 53619038, 53583782, 53543598, 53421371, 53285152, 53234447, 53254639, 53224869, 53100056, 52950584, 52931061, 52981087, 52954826, 52869316, 52746407, 52650852, 52609509, 52586079, 52540043, 52493233, 52424736, 52312950, 52289379, 52191353, 52049927, 52022560, 51925014, 51907558, 51901138, 51798210, 51740913, 51646557, 51658211, 51601147, 51400845, 51448093, 51500996, 51270992, 51015709, 50924030, 50843819, 50822025, 50897339, 50772884, 50589001, 50537884, 50391949, 50189526, 50142017, 50126968, 50060696, 50057232, 50038929, 49960888, 49857475, 49691380, 49503429, 49410061, 49392025, 49342964, 49305744, 49148453, 48841511, 48786396, 48915886, 48876606, 48733055, 48565197, 48433277, 48406483, 48324875, 48183044, 48113758, 48051765, 47966698, 47904968, 47792397, 47601887, 47428905, 47286896, 47255672, 47268883, 47123505, 46985447, 46913902, 46804794, 46652264]
3162.2D6652264j80371j14757p1312p824J9283q5800j13171p4936j47708k24106j08883
3172.8D5542679q6392j19331o5838r4204j106j3428j55071j13579j38958j41640j7787
3183.4D4595345j6362j15608j30642j40716j29826p7866j21612p5306l4565j80576
3193D3572266k40940p5310L6918n3432q7818r3922j31969j52615j22841l4843p0908
3203.6D2544586r5096m2824p9411j62380n7964J15497m1103k11315j35201q6380k20878
3214.3D1527531k33242k3423j6998j8524L803j32248r8015O497r2735j80401j24298
3224.9D0617947j07251N185J8177j13236l2104j00979j51341n5671j22559j82106r4631
3235.5C9681431P6492l1032p8225P9609n6991j98651j80153n5271n2894k14745j02070
$$ y = [46652264, 46471893, 46357136, 46285824, 46278000, 46297283, 46211483, 46098312, 46023376, 45875668, 45651562, 45542679, 45456287, 45336956, 45271118, 45176914, 45175808, 45162380, 45007309, 44893730, 44754772, 44613132, 44595345, 44578983, 44463375, 44332733, 44192017, 44062191, 43984325, 43862713, 43787407, 43752842, 43572266, 43331326, 43256016, 43292934, 43239502, 43151684, 43057762, 42925793, 42773178, 42650337, 42615494, 42544586, 42449490, 42406666, 42327255, 42164875, 42106911, 42222408, 42181305, 41969990, 41834789, 41748409, 41527531, 41294289, 41270866, 41253868, 41235344, 41239147, 41106899, 41008884, 41015381, 40922646, 40742245, 40617947, 40510696, 40515881, 40534058, 40420822, 40388718, 40287739, 40136398, 40080727, 39958168, 39776062, 39681431, 39757923, 39726891, 39648666, 39728275, 39671284, 39472633, 39292480, 39237209, 39184315, 38969570, 38867500]
3246.1C8867500J1994n6198j30223n0422N7037j51218j07708J36150q5007j87095l4481
3256.7C8270329j9234q4336r9575n607o9294r8591o7070r0176R644r0305j48358j8276
3268.3C7489151M5757k7126j76655n7102p2941k01897j32244o7474N8331Q693k7027
3278.9C6839466J07j6335J2345k36367k19512J14704O7615p8625j06109m0806M1000
3289.5C6377483j19735l02899j14822J44001P355j48098l4222r00q3424p7568N245
3300.1C5652416J0670l8643o3633q7498l0719o6952j30974m1111J5575q1028k39410
3310.7C4898693o8954N1521p7568j0059l8987j1383q846j66267o0460j3691n1811k5779
3322.3C4416409j603j7730j57006j80515j70921r3552R7618k3475j38669m8500j47995
$$ y = [38867500, 38879494, 38823296, 38693073, 38642651, 38699688, 38548470, 38440762, 38576912, 38491905, 38304810, 38270329, 38251095, 38166759, 38067184, 38061577, 37992283, 37893692, 37826622, 37736446, 37746090, 37655785, 37507427, 37489151, 37534908, 37507782, 37331127, 37274025, 37201084, 36999187, 36866943, 36799469, 36857800, 36866493, 36839466, 36839573, 36823238, 36835583, 36599216, 36379704, 36494408, 36562023, 36483398, 36377289, 36336483, 36377483, 36257748, 35954849, 35840027, 35984028, 35991383, 35843285, 35809063, 35808163, 35724739, 35647171, 35652416, 35663086, 35624443, 35560810, 35473312, 35442593, 35375641, 35244667, 35203556, 35219131, 35138103, 34898693, 34829739, 34881260, 34803692, 34793633, 34754646, 34743263, 34734417, 34568150, 34507690, 34493999, 34442188, 34416409, 34414806, 34397076, 34240070, 34059555, 33888634, 33795082, 33892700, 33869225, 33730556, 33682056, 33534061]
3332.9C3534061j83055Q182J66260K1320k51144j87496p9781o9763q9630q0269Q1547
3343.5C2870232O4571j72604k64854j54572j73458j07486M6379J6800K8640j85516
3353.1C1968132j79785Q6853p9134k21149j49584n6852l9898N2133J1168k39176k15641
3363.7C0937067j20893L9417O1167p2228j12530p4367l750j43196q9787o5099j13444
3374.3C0242357o2513j44875L3747L6709n8508n0406r9884j9764j55996p0944L3120
3384.9B9683043k08735q4995J86382M7192k73926j39181Q1842j06752k03844J1806
3394.6B8992832J35735M6465j6856r8507o0546J1354j09453j21605j8551M9088K3721
3405.2B8833677Q4053N4167k72608k32952L5719M3852J12844J33561j06129j11569
$$ y = [33534061, 33351006, 33359188, 33525448, 33546768, 33295624, 33108128, 33028347, 32958584, 32868954, 32788685, 32870232, 32934803, 32762199, 32497345, 32342773, 32169315, 32061829, 32108208, 32125008, 32153648, 31968132, 31788347, 31875200, 31796066, 31574917, 31425333, 31368481, 31328583, 31380716, 31391884, 31152708, 30937067, 30816174, 30855591, 30916758, 30844530, 30732000, 30657633, 30653883, 30510687, 30420900, 30355801, 30242357, 30179844, 30034969, 30068716, 30105425, 30046917, 29996511, 29896627, 29876863, 29720867, 29649923, 29683043, 29474308, 29389313, 29575695, 29622887, 29348961, 29209780, 29291622, 29184870, 28981026, 28992832, 29128567, 29175032, 29158176, 29059669, 28999123, 29010477, 28901024, 28779419, 28760868, 28809956, 28833677, 28917730, 28971897, 28699289, 28466337, 28502056, 28545908, 28658752, 28792313, 28686184, 28574615]
3414.8B8574615Q0521j8129r0992J5053P8191N7406j10346j32820q1692q6109J02194
3425.5B8387892J73994k8130j58539j880J21900j8249l6703j0371O7395J72849Q0553
3436.1B8750711L5120j9897J2522k730m9467M2786q8036m772Q0788J6483J80410N1655
3447.6B9005573j16667M7467J40598M2341j4614J063J15089K39981L9274l9476j8626
3458.2B9442003K1456J75606O2673O2479R2490K645N1712O0446M6356Q1951J03419
3468.8C0203236O98R176R7809Q3397R3013K9135O8817R5084j2820J37232K26582N0758
3480.4C1082117Q0624R2745o0814K7168J37699Q6826M790R8428J62278M3571O8903
3491C1824335J05677J17908J52352J36718M395p9369K7371O0329J80363J86386J01311
$$ y = [28574615, 28655136, 28637007, 28546015, 28561068, 28639259, 28696665, 28586319, 28453499, 28371807, 28285698, 28387892, 28561886, 28533756, 28375217, 28373337, 28495237, 28476988, 28440285, 28429914, 28497309, 28670158, 28750711, 28785831, 28765934, 28778456, 28775726, 28726259, 28769045, 28681009, 28676237, 28757025, 28773508, 28953918, 29005573, 28888906, 28936373, 29076971, 29119312, 29104698, 29105761, 29220850, 29460831, 29500105, 29460629, 29442003, 29463459, 29639065, 29701738, 29764217, 29856707, 29859352, 29911064, 29971510, 30017866, 30099817, 30203236, 30203934, 30213110, 30310919, 30394316, 30487329, 30516464, 30585281, 30680365, 30667545, 30804777, 31031359, 31082117, 31162741, 31255486, 31194672, 31221840, 31359539, 31446365, 31451155, 31549583, 31711861, 31755432, 31824335, 31930012, 32047920, 32200272, 32336990, 32341385, 32262016, 32289387, 32349716, 32530079, 32716465, 32817776]
3501.6C2817776J15280l6183K1328J45852J09352J7582M3968J72561J08292P0088J25461
3512.2C3711357J77647N3112n3570J3912J27556K65080J49150Q3111Q5587Q0642J58764
3522.9C4852348L6175K6795J77440K10598L1258M4925K47052J86561l9299o6753K25361
3533.5C5932461J08734p816K17670J32538J28563J94504J77322J52683J13037J35018
3543.1C7284714K07561J37932K3514J78116N5378L3149J51440J94920J63692m3838
3552.7C8386578J92203N4627J6304K92965J11648K12452K24381l3837O695L55171M67442
3563.4D0286629R1430R6512J99440K98741R8316j62838J73103J48022M2057J31046
3573D1402458K32231K05059J57284J35464J94355L36304J51634O8634J78081K22275
$$ y = [32817776, 32933056, 32896873, 32918201, 33064053, 33173405, 33190987, 33234955, 33407516, 33515808, 33585896, 33711357, 33889004, 33942116, 33888546, 33902458, 34030014, 34295094, 34444244, 34527355, 34612942, 34693584, 34852348, 34888523, 34915318, 35092758, 35303356, 35334614, 35379539, 35626591, 35813152, 35773853, 35707100, 35932461, 36041195, 36033379, 36251049, 36383587, 36512150, 36706654, 36883976, 37036659, 37149696, 37284714, 37492275, 37630207, 37653721, 37831837, 37887215, 37920364, 38071804, 38266724, 38430416, 38386578, 38578781, 38633408, 38649712, 38942677, 39054325, 39266777, 39491158, 39457321, 39464016, 39819187, 40286629, 40378059, 40474571, 40674011, 40972752, 41071068, 40908230, 41081333, 41229355, 41271412, 41402458, 41634689, 41839748, 41997032, 42132496, 42326851, 42663155, 42814789, 42883423, 43061504, 43283779]
3582.6D3283779J00224J69250N29679J62300N7273K51503j46362L97812M49455J71109
3592.3D5426022M8301J37493M76319J71894J47186K69764R7019K45251K22290K82864
3601.9D7524403J53289k941K61692L68485L67248K46113M05522K0000l14892M98612
3611.6D9527531M87697O9229K12960J8238M48021N35644J14880J23264J1059J90708
3621.2E1739231M09935L42182L18455M35165K99996J28582N19745K66193p63267K04322
3630.9E3900539M92741O01593M46476J04801K07607M34887M10786J36505J85368J94370
3640.5E7115673L23772K73999m1661J93379L15407N78125M03396j46324N59952K41871
3650.1E9817589k67853j94683M07062M27712L52196N25440n11444K16316N73696J69823
$$ y = [43283779, 43384003, 43553253, 44082932, 44245232, 44302505, 44554008, 44407646, 44805458, 45254913, 45426022, 45474323, 45611816, 46088135, 46260029, 46407215, 46676979, 46773998, 47019249, 47241539, 47524403, 47677692, 47674751, 47936443, 48304928, 48672176, 48918289, 49323811, 49343811, 49028919, 49527531, 50015228, 50084457, 50297417, 50315655, 50763676, 51299320, 51414200, 51537464, 51548523, 51739231, 52149166, 52491348, 52809803, 53244968, 53544964, 53673546, 54193291, 54459484, 53696217, 53900539, 54393280, 54994873, 55441349, 55546150, 55753757, 56188644, 56599430, 56735935, 56921303, 57115673, 57439445, 57713444, 57671783, 57865162, 58180569, 58758694, 59162090, 59015766, 59575718, 59817589, 59549736, 59355053, 59762115, 60189827, 60542023, 61067463, 60556019, 60772335, 61346031, 61515854]
3659.8F1515854K44747J05293K58637J19411N9948K48944K39723N52978J90945K4666
3669.4F3561146M26754p22676J946Q83167J024704N6832j357010m4407M19216M34990
3679.1F4684662k0233R9548K02721K0401R4246J21597J24069L91541O83227l51715
3688.7F6050064k38792P28698m76196l13446K72865m7729O0829R1759p515K5802O3050
3699.3F6209389K61154L44063m80995k00310O23138K09564k3071n417L13332N54718
3709F7805565o78566K50610O78757r77005N341K77908J74812R3605K06475L31764j96213
3719.6F7973053j60416N80147J98677n48660K51762Q6701k29599k63230P1709L16017
3729.2F8276161J29746P54585j617r27147O09481P4257o88224m3702K78969J11969
$$ y = [61515854, 61760601, 61865894, 62124531, 62243942, 62303890, 62552834, 62792557, 63345535, 63536480, 63561146, 63987900, 63265224, 63267170, 64150337, 65175041, 65231873, 63874863, 63830456, 64249672, 64684662, 64664429, 64763977, 64966698, 64987099, 65081345, 65202942, 65327011, 65718552, 66401779, 66050064, 65811272, 66539970, 66063774, 65750328, 66023193, 65975464, 66036293, 66128052, 66120537, 66146339, 66209389, 66470543, 66814606, 66333611, 66133301, 66756439, 66966003, 66942932, 66937515, 67250847, 67805565, 67126999, 67377609, 68056366, 67079361, 67084702, 67362610, 67537422, 67631027, 67837502, 68169266, 67973053, 67812637, 68392784, 68591461, 68042801, 68294563, 68381264, 68151665, 67888435, 67960144, 68276161, 68405907, 69160492, 69158875, 68231728, 68841209, 68915466, 68227242, 68183540, 68462509, 68574478]
3738.9F8574478J79749J60171n68397K29339J224228k09740j469627O66489L85795
3747.5F9172485O17165K82967j244248P89948p7515j052483L62557L04252K65694l69324
3757.2F9051498J55793O66168o61301m03137K84683j9912l5874M02702q2626m77348
3766.8F8880646M00276P61200J15768j073959q8768L64220J95327j6731k25975K3094
3776.5F9335098J18988L56514J0109q10745K32964K85324M6882J65634j80389r361
3786.1F9551018J38374M3320R804n0499q0017j86425O0097J02921O0180J49834m26293
3796.7F9372314k29660L42209M34319O35086j02783j200707r3315K67929M85405O67114
3806.4G0577911p21748p17575L12248J76422m638m4953N669J46339M63249j2435j117478
$$ y = [68574478, 68754227, 68914398, 68346001, 68575340, 69799568, 69589828, 68120201, 68786690, 69172485, 69789650, 70072617, 68828369, 69618317, 69540802, 68488319, 68850876, 69155128, 69420822, 69051498, 69207291, 69873459, 69212158, 68809021, 69093704, 69073792, 69037918, 69440620, 69357994, 68880646, 69280922, 70042122, 70157890, 69083931, 68995163, 69359383, 69554710, 69537979, 69312004, 69335098, 69454086, 69810600, 69820709, 69009964, 69242928, 69528252, 69575134, 69740768, 69560379, 69551018, 69689392, 69732712, 69742516, 69692017, 69612000, 69425575, 69485672, 69588593, 69648773, 69798607, 69372314, 69142654, 69484863, 69919182, 70554268, 70451485, 69250778, 69157463, 69425392, 69910797, 70577911, 69856163, 69138588, 69450836, 69627258, 69622620, 69577667, 69583336, 69729675, 70192924, 70180489, 69063011]
3817F9063011L99368O40435N04455L31879j136147l92837J77666K38197K40982L899
3826.6G0070908m63730j11344K28836L03544K03689p26677J23779P33025m67674j95694
3836.3F9698662P09373o31057l27874R22226k94533l56697N05509j19225n69633J00471
3845.9F9637222J66123m3495J82579J20086L15598L89564l25065O08024k189316k39120
3855.6F8622200J116158j3337j56257K28370K96685L89923n63706l54683O70212j76712
3865.2G0058853p13837L10723N85876P04338o07872j136871K13020N31617K38601q42529
3874.8F9341919P8957L22120l6712K08122N18356k04079o81221L99277J01593L40393
3884.5G0388725O76567j300697k54997K81219J47209L99048j43593r08912J86195M72778
$$ y = [69063011, 69462379, 70102814, 70607269, 70939148, 69803001, 69410164, 69587830, 69826027, 70067009, 70070908, 69607178, 69495834, 69724670, 70028214, 70231903, 69505226, 69629005, 70362030, 69894356, 69698662, 70408035, 69776978, 69449104, 70371330, 70076797, 69720100, 70225609, 70106384, 69536751, 69637222, 69803345, 69759850, 69942429, 70062515, 70378113, 70767677, 70442612, 71050636, 68861320, 68622200, 69738358, 69725021, 69568764, 69797134, 70093819, 70483742, 69920036, 69565353, 70235565, 70058853, 69345016, 69655739, 70241615, 70945953, 70338081, 69201210, 69414230, 69945847, 70184448, 69341919, 69420876, 69742996, 69706284, 69914406, 70432762, 70228683, 69547462, 69946739, 70048332, 70388725, 71065292, 69764595, 69509598, 69790817, 69938026, 70337074, 70193481, 69284569, 69470764, 69943542]
3894.1F9943542k81005q3237P1381M67857L97797j029717L37204K16438k78465M41383
3903.8G0203178m93240l63022J61377J67244n569k6886K12181R2392j06537j29524
3913.4F9711594j419Q8249L10821k08427m06601M64294L1655m59473J8631K11853K01553
3924F9962730j68899j17661J01876j1658n5519o7528L0632J07063J9463m8882j26594
3934.6F9625023l6102J38832l4806j15295J9516q682K6718R689j15112j0224L9689
3945.2F9539246J77795J63910k26921J3122K12059m0428R6764J3328j49086m9102J396
3955.8F9752083o1241j50101M2732m700j38603R6894J01387J7013Q3077p6844j38282
3966.5F9523415Q2771Q0933p7279m4448J6899o897k9297m0161J7547J95092J35719
$$ y = [69943542, 69662537, 69579300, 69650681, 70118538, 70516335, 69486618, 69823822, 70040260, 69761795, 70203178, 69709938, 69346916, 69508293, 69675537, 69669968, 69643082, 69855263, 69947655, 69841118, 69711594, 69710175, 69798424, 70109245, 69900818, 69494217, 69958511, 69990166, 69530693, 69549324, 69761177, 69962730, 69793831, 69676170, 69778046, 69766388, 69710869, 69643341, 69673973, 69781036, 69800499, 69751617, 69625023, 69588921, 69727753, 69692947, 69577652, 69597168, 69588486, 69615204, 69624893, 69509781, 69499557, 69539246, 69717041, 69880951, 69654030, 69667152, 69879211, 69838783, 69935547, 69948875, 69799789, 69750687, 69752083, 69690842, 69540741, 69583473, 69578773, 69440170, 69537064, 69638451, 69655464, 69738541, 69661697, 69523415, 69606186, 69687119, 69609840, 69565392, 69582291, 69575394, 69546097, 69505936, 69523483, 69718575, 69854294]
3977.1F9854294j39214r2468J8288N9372J70883j52413k67852K3880J4785J91903K00614
3987.7F9882072M5739J1245k01179m4106O5407O1524p378k53914j0872R5055j29242
3998.3F9514351j21834J03645
4000.2F9496162
$$ y = [69854294, 69715080, 69622612, 69640900, 69700272, 69871155, 69718742, 69450890, 69474770, 69489555, 69681458, 69882072, 69927811, 69939056, 69737877, 69693771, 69759178, 69820702, 69813324, 69559410, 69548538, 69643593, 69514351, 69392517, 69496162]
##END=$$ End of the data block
