##TITLE=$$ Begin of the data block
##JCAMP-DX=5.00 $$ ACD/SpecManager v 10.08
##SPECTROMETER/DATA SYSTEM=Varian
##DATE=07 Jan 2013 17:14:06
##DATA TYPE=INFRARED SPECTRUM
##DATA CLASS=XYDATA
##ORIGIN=
##OWNER=
##NPOINTS=3735
##FIRSTX=399.26403809
##LASTX=4000.35498047
##MAXX=4000.35498047
##MINX=399.26403809
##MAXY=79.98448181
##MINY=18.43434334
##XFACTOR=1.0000000000
##YFACTOR=0.000000100000000
##FIRSTY=62.13437653
##DELTAX=0.96440572
##XUNITS=1/CM
##YUNITS=TRANSMITTANCE
##XYDATA=(X++(Y..Y))
399.3 621343765 619239044 612126617 605688171 611862602 619544868 621034279 622006149 622126160 625897713
407.9 625897713 624501190 618361473 614321136 613001404 621803436 623648682 618544426 621060715
415.7 621060715 623174248 619931068 613091469 615665092 613533058 609489746 603665161 601167641
423.4 601167641 604129562 605601120 613553162 620042839 620700607 618520889 613440742 609260941 605515060
432.1 605515060 604777527 602184639 598675613 605827599 613902245 615347099 616458397 617399063 614769020
440.7 614769020 606904373 604238319 605704422 606833916 609077301 610061340 613135414 611941795 608179665
449.4 608179665 608831940 607035255 599842453 594014168 596498909 600321274 605132790 609911766 602257347
458.1 602257347 599037361 602978363 604712715 601208420 598554535 598324928 596653595 595108719 593693390
466.8 593693390 595187492 600704346 607640533 610323715 608002510 602425728 594488754 592806740
474.5 592806740 594039230 593774414 594462395 597786484 603888550 609574890 608295555 605153198 607198639
483.2 607198639 606349602 600997276 596202850 594290504 597880020 600422287 602715721 606290054 609526100
491.8 609526100 608974915 604611435 601531334 597687569 594931107 595588989 597585907 600767403 602045860
500.5 602045860 600898094 602716751 604247513 602108765 600273209 595675507 591896858 593945236
508.2 593945236 592670097 591028442 591428833 592719765 593953514 592292938 590403595 587946510 582274475
516.9 582274475 578128281 578450623 579337044 580120697 581488953 584137726 585910988 584691010 583265343
525.6 583265343 581760559 578609238 575995941 576987610 576928749 575152054 575994568 578442192 582637749
534.3 582637749 583365517 581475410 579790764 577068405 575846825 575161171 575278969 575883904 578147011
543 578147011 580417557 581650543 584276657 584624863 583451996 582045059 581272659 580747032 579150009
551.6 579150009 578822899 579844589 582048378 583719292 585424423 585970459 585435944 584984055 582308540
560.3 582308540 580983887 580617752 579978714 580540771 582048225 584018097 585065422 585157318 585661926
569 585661926 586262550 584192047 582145767 580265541 577185707 576730614 578024788 580233040 580673904
577.7 580673904 581095009 582115746 580587921 577145729 574192924 575476265 576830406 576614113 576783600
586.4 576783600 577069664 578751640 580393143 582677155 582311974 580307617 579510193 577254639 576534348
595 576534348 576776962 576218109 575807724 576826973 577253151 576046371 574579086 571129227 567797928
603.7 567797928 563481483 558481483 553985214 547127419 539225426 530500298 519488182 505935097
611.4 505935097 493163338 480443687 470520782 465799789 464103661 465493584 467120399 467344856
619.2 467344856 463636627 456461906 445195351 432719650 423617325 420334816 428596954 442575073
626.9 442575073 459752655 476553459 491423225 503170815 510381355 514511528 512273102 507085037
634.6 507085037 499990425 491153870 483227272 476540489 473953171 477304001 488212662 503352509
642.3 503352509 522024345 541090279 557820740 569960098 579077988 586874580 590870323 592941246
650 592941246 595249252 597733154 601474113 605708961 609248924 611520386 611839981 612365150 612868919
658.7 612868919 612247009 611461411 610648384 611205788 613130188 615764656 619224586 621601295 619361420
667.4 619361420 610959396 618045502 620534286 620559883 620940819 620868073 621254082 622626343 625582161
676.1 625582161 628780556 630986366 631311684 629935722 629094658 628311424 627695351 627126617 626725998
684.7 626725998 627163544 627924843 628854179 629184532 629254532 627464790 623740196 621283150 618916435
693.4 618916435 615794029 614061852 614232216 615352859 616487465 616935043 616876984 616422157 614869919
702.1 614869919 613032875 611942711 611586761 611799049 613264847 615780869 618258476 621248703 623908958
710.8 623908958 626039467 627459641 627390327 627466011 627454033 627112656 628957710 632167053 634963455
719.5 634963455 638347549 641373215 643511581 643898315 642324753 641178131 639875259 638511581 638088531
728.1 638088531 638384933 639269447 640042343 641577911 642549286 641149216 639855118 638342094 635644035
736.8 635644035 634138031 633702698 634118271 635468483 636726189 638597908 640347824 641959610 643718491
745.5 643718491 643848114 643777237 644146576 644439850 646617279 651019821 655576248 659912796 664742584
754.2 664742584 668768005 671112366 671311493 670797195 670736084 669840775 669216080 671214447 674840546
762.8 674840546 677791290 679905167 681551666 681663742 679670868 676614609 672939072 669386826 667387314
771.5 667387314 668711395 671547699 673587570 677716904 682504272 685147858 686080551 685860443 686752090
780.2 686752090 686821976 685569382 685489273 687271652 691335220 696230774 700486984 703045197 703321915
788.9 703321915 701648788 699560242 697205276 695457306 695121765 695635223 697929535 700266724 703322449
797.6 703322449 706131744 706688614 706401749 703217545 699532318 697624130 696657181 696348190 696904907
806.2 696904907 699457169 703213501 707600555 710294800 709769745 707357941 704298477 700564194 697398148
814.9 697398148 697365341 699473419 702526321 706001968 709519806 711598892 711242371 709631729 706551208
823.6 706551208 702472000 698233948 695657272 694384918 695121536 697715302 698611984 698501587 696537704
832.3 696537704 692046051 686287079 679644852 673889236 670051117 666734085 664046555 663532104 663531647
841 663531647 663169022 662589569 660693130 657344971 652874603 648268585 645131760 644613647 646495438
849.6 646495438 651121216 657094498 662278442 666930161 669736481 671439743 672033615 670625229 670051880
858.3 670051880 670960846 673841858 678263397 683115540 687880173 691858368 695073700 696114960 694608841
867 694608841 690748062 687095642 685556946 685225449 686930695 691508331 696715851 700438995 702578354
875.7 702578354 703198624 702778625 699532776 694668427 690510483 686619949 685008240 685799484 687821732
884.4 687821732 689488602 690411682 690633240 688173828 683772964 678978348 674978333 672256546 671635590
893 671635590 673629227 677902222 682617187 685519333 688059006 688915634 686387024 682512436 678824463
901.7 678824463 675867386 674005432 674268265 676153793 678663177 680302505 679825058 677552872 673467484
910.4 673467484 667745438 661307755 655781097 651296768 648921280 648432083 648095551 648585892 649119186
919.1 649119186 647951889 644753952 639584732 633005409 626711884 622096710 619693947 620200653 622134285
927.8 622134285 623788757 626157799 627867966 627694054 625999298 623512306 621882629 621038361 621839905
936.4 621839905 625083466 630059547 636636238 643586273 649050140 653162460 656454544 657598953
944.2 657598953 656228104 654525833 654879913 657540894 661988754 667123184 672122650 676626053 678982315
952.8 678982315 678308029 675356445 671309357 666299820 662092438 660021286 659503403 660030136 660399551
961.5 660399551 659944305 659061279 656928406 652455597 646938705 640813293 634748077 631497040 631082039
970.2 631082039 631851196 633538628 635633202 636962051 635995789 633021507 629360428 625641289 622035255
978.9 622035255 619183578 618419609 618820457 619301147 619797516 619838333 618849411 615615997 611111946
987.6 611111946 605353279 598436852 592131119 586487656 582119331 576396217 566422768 552054787
995.3 552054787 539409599 539042435 549692955 561208115 566181183 566777191 566402855 566978035 569084015
1004 569084015 570605011 571681404 572496071 572861176 571326332 567758636 563298454 558734932 554971008
1012.6 554971008 551901360 551297073 551710739 551947632 551767044 550733490 548971100 544978600 539760742
1021.3 539760742 534309158 530198975 526467361 523977051 524485130 525067291 525664520 524781418 522477989
1030 522477989 518904877 514988632 511271858 506818733 503791542 501883240 502006111 502523689 503616867
1038.7 503616867 505028419 504971962 503971519 501222725 498770294 495981636 494396172 493959579 494618874
1047.4 494618874 497245102 500047455 503775940 505543137 506381798 505316048 502666512 500499611
1055.1 500499611 499779282 501255608 500832901 502275200 503852539 505070992 506430359 505782928 505620193
1063.7 505620193 502957764 500425415 497500343 494840088 494297638 494518051 496316986 496911011 498119431
1072.4 498119431 497809296 497004280 494891205 490270386 487790222 485584488 484367218 483449631 484639816
1081.1 484639816 486776733 488155060 488738708 487089920 485009232 480607262 476433296 471770287
1088.8 471770287 467840576 464908257 460899391 457986984 452039452 445845337 437735252 427003708
1096.5 427003708 415312119 402581062 391446152 380098190 371371841 360744476 349992638
1103.3 349992638 339592247 329176292 319903049 307933865 298417416 287503281 277488556 267524300
1111 267524300 259255905 253595791 247174168 244860516 240742722 238953171 238089657 238867111 240336342
1119.7 240336342 240236053 242010860 242314758 245723457 247309723 250629482 253533516 253843327 255303993
1128.4 255303993 254482174 256147156 254533062 252974167 250120945 245933819 242921448 237951221
1136.1 237951221 236251659 232324257 230677490 227906513 223898277 220674973 214870167 211022663
1143.8 211022663 204850941 201451550 197090492 193853092 191927090 188432808 187702942 185254879
1151.5 185254879 185447884 184343433 185480900 186563129 186885300 189945946 191096210 195077114 196734390
1160.2 196734390 200229416 203649006 207456245 213037453 216631794 222367306 225377254 231290092
1167.9 231290092 237302780 243722439 251416836 258372345 267890244 275535393 284918823 293133602
1175.6 293133602 302455807 311804199 319653816 328732948 336730156 347034836 355676689 365000572
1183.3 365000572 374569969 383226929 390812187 395900497 402280045 406971817 412142334 416737556
1191 416737556 421860504 428516273 434587936 441774330 447961693 454639473 459687576 464280891 468736076
1199.7 468736076 472255783 476945648 481638603 487976646 494026031 500311356 506022263 510443153
1207.4 510443153 513965836 515607185 517545776 518436623 520030823 522832642 526091881 529718170
1215.1 529718170 533179131 537129707 539376984 540776939 540824280 539884949 538599396 537068138 536950150
1223.8 536950150 537477417 540066872 542791443 545103874 547068977 547421188 547088890 546116867 544867706
1232.5 544867706 543241272 543363533 544375725 545949860 548457680 550645523 553539848 555129814
1240.2 555129814 555237389 554046822 552720375 551679611 550335884 550536118 551839333 554345436 556453400
1248.9 556453400 558713036 560336151 560559807 560642395 559030647 557476311 556328316 556346588 557346725
1257.6 557346725 558970146 561781425 564044342 566102753 566820602 566939163 566537781 565663071 564886284
1266.3 564886284 564114075 565276451 567168617 570218773 573390388 576216278 579059830 580769463
1274 580769463 581562691 580988579 580601044 580597343 581619339 584147453 587577934 591763420 595259514
1282.7 595259514 598431053 600695915 601844749 602117004 602164688 602847519 603763924 605427895 608050079
1291.3 608050079 612039490 615959015 619204254 621909447 623154182 623212891 622725105 622231140 621868210
1300 621868210 622455521 624254036 626731300 629682732 632570381 634965973 635966530 635704689 634153366
1308.7 634153366 632519341 632145462 631897659 632460365 634292183 636861191 639431000 641090622 642223663
1317.4 642223663 642324066 641302109 640317307 639612846 639424629 640157394 641549683 643446960 646139832
1326 646139832 648611603 649909973 650470581 649900894 648405609 646687546 645475616 645303268 645820618
1334.7 645820618 646544952 647699814 649169617 650014114 649739075 648980789 648827133 648219833 646780167
1343.4 646780167 646262665 646174469 646448212 647955627 649687271 650845108 651553040 651566772 650162582
1352.1 650162582 648214417 646230316 644338303 643489151 643833008 644844894 645966949 647107086 647031937
1360.8 647031937 645912552 644421997 642102661 641470337 640424118 638904343 637998886 637653389 638778343
1369.4 638778343 639839935 640073090 639579201 637795181 634592857 632347946 631581154 631254883 630605125
1378.1 630605125 630553818 631504898 632341385 633034210 633313065 633296165 633031464 632377815 631412582 629539032
1387.8 629539032 629773598 631148758 632244606 633150558 634137611 635069275 633618431 631112251 631020622
1396.4 631020622 630296783 628385811 625675659 625724792 626804810 626916580 627224960 627206459 626098938
1405.1 626098938 626000404 625800667 624301643 622777672 621562042 620531960 620114632 620518417 621562614
1413.8 621562614 622322273 622303429 621482773 620241241 619288216 615399628 616224442 618534317 619057274
1422.5 619057274 619415321 619819679 621834183 624068451 624754105 625501633 625290260 623830528 623877563
1431.2 623877563 624685249 624785995 625332794 627092285 627578697 626922569 629852715 632974129 634138756
1439.8 634138756 634033928 633999329 633998909 634874954 635240746 636184883 637265015 636916084 637188377 639523392
1449.5 639523392 641435776 641235886 640768204 640602264 640350342 639609108 639537964 638528404 637540474
1458.2 637540474 643100815 647413406 650810928 652144241 652004700 652969131 650161362 650604172 653439636
1466.8 653439636 656190948 658507843 659995956 661845932 660315933 657998352 661074142 665944672
1474.6 665944672 669529648 669582672 671976776 675377960 677463684 678730850 679802094 682205353 684350510
1483.2 684350510 685166092 685196152 684774475 682617416 681250992 682276077 680649109 680680008 683528137
1491.9 683528137 685998993 686601105 686022797 684203491 677333908 678611679 678051758 675963669 677319870
1500.6 677319870 676846848 676418915 676055908 676106720 673874512 662373657 655820312 658514633 661445084
1509.3 661445084 660966568 662211456 660756760 658870010 659016953 656562576 654828796 650094910 648027115
1518 648027115 651139603 651913681 646276016 641759796 644677429 646930466 648047867 645075302 645152435
1526.6 645152435 645526123 643936157 644409180 644552383 643110886 641085052 639183960 636713676 638358994
1535.3 638358994 639330101 639518890 639695816 630173721 623095512 627788200 629424019 628691559 630761414
1544 630761414 631900635 631883659 634856644 635795822 636004982 634284630 633587418 636526299 637651978
1552.7 637651978 638097687 635467987 636565590 639579506 639894829 631399651 620782204 633281708
1560.4 633281708 641183548 645603561 647658615 648185349 647247772 647822495 649595566 649708176 648805161
1569.1 648805161 645112610 648143311 650624847 650319061 650253754 650358047 649610748 641683044 643958359
1577.7 643958359 646182785 645694580 645080109 643721771 643092728 641266022 640172958 639084778 637494774
1586.4 637494774 635892029 633152161 631227341 628203239 626174850 623942909 622046547 619481964
1594.1 619481964 616681213 615647049 612827873 611101837 608437271 606385422 603463707 599745979
1601.9 599745979 597346535 594193649 593207741 590888748 588864784 585960617 583898239 581548615
1609.6 581548615 577998543 576935654 573489952 571791992 568750763 566423454 562849541 554540977
1617.3 554540977 558292809 558073883 557095222 554351006 552930984 549733849 544758759 545902061 544686432
1626 544686432 544229469 540139313 539262466 539264107 537962914 537093239 534695625 534796944 532479401 526595078
1635.6 526595078 525311394 526894150 528137817 528384323 529511452 528307838 529266396 528874283 529748230
1644.3 529748230 529919891 525459976 525713158 524537010 528936386 530795326 533258934 535214119 531127243
1653 531127243 528425484 531510696 537195549 538672676 540922432 542495537 544101982 545669441 546614571
1661.6 546614571 548794975 550011177 554908447 557490082 559437294 561078949 561120720 561168022 562613564
1670.3 562613564 567026939 569138870 573600121 577414169 578195076 580104446 583397255 586655121
1678 586655121 587522736 588986015 590351524 594576302 598396530 595659752 596375389 602069855 609556389
1686.7 609556389 613210526 615586853 618804932 621276741 625062752 627750854 630970154 634163971
1694.4 634163971 636672363 635423660 641200562 648365707 653460617 655631027 652815247 661127701
1702.1 661127701 666454010 668721542 671216125 674293900 678130417 682938538 687820740 690128174
1709.9 690128174 691819000 693913956 695157928 696364746 695300522 697034149 701104279 701960297
1717.6 701960297 699947662 705369644 710013580 712159576 713330841 712820206 712967224 714850082 716101379
1726.3 716101379 717351379 719066772 720599365 719170227 719464645 722558899 723483353 718135452 714105759
1734.9 714105759 720260010 724000473 725740433 728341599 728062973 728252716 732339630 733800125 732355728
1743.6 732355728 733966064 736367493 737056351 738002548 738249130 739847717 744952545 746672745 747661896
1752.3 747661896 751886520 754029465 755166016 755796967 753900909 755423737 757803345 759862213
1760 759862213 762089233 759848251 760889435 764776688 766166000 766625671 767290268 766860962 763730698
1768.7 763730698 765797043 768378677 766180725 763618546 765343246 770456238 772238922 771198883
1776.4 771198883 772696609 772756577 772729492 771773300 771088409 773608475 776249542 777606049 776490097
1785.1 776490097 776738052 778414383 778588409 778072357 777786026 776554108 775382996 772648926 774391632
1793.8 774391632 779136505 780286865 780456848 782122269 782734833 781166153 779367065 780497589 780086136
1802.4 780086136 780692902 782723160 783729095 784815979 785218811 785328751 785775909 785364914 783334961
1811.1 783334961 783471756 784562149 785140839 786190109 786802521 787890320 788225861 788563538 789036865
1819.8 789036865 788377304 788153839 787115555 787297592 787360458 784872589 786650620 789818954 791149292
1828.5 791149292 789354553 786295090 788309326 790398483 790209045 789988785 789897308 789979019 790043488
1837.2 790043488 790684738 792598572 793483505 794233856 793758087 793260727 791791687 786053848 788357468
1845.8 788357468 790753708 790900040 791823883 793613892 795294113 795582199 795659409 795474243 795088654
1854.5 795088654 794438095 793699188 793393097 793215332 793774490 794861221 796311493 796762924 797021179
1863.2 797021179 796918945 796207809 795758438 794109726 792802658 790936890 791246719 794307098 796590195
1871.9 796590195 797806244 797823486 797664795 797232819 796701889 795891266 795374908 795303192 795309219 796411667
1881.5 796411667 797276077 798262100 798528137 798243637 798517380 797925339 797551041 795746689 793576431
1890.2 793576431 795049438 796889191 797868347 798687286 798427887 798170624 799157486 798891983 798184204
1898.9 798184204 797442474 796925125 796993942 796866074 797417984 797919846 798943253 799657288 799295349 799050140
1908.5 799050140 798498535 797400360 796631012 796681290 796540451 797160645 797657471 798463364 799844818
1917.2 799844818 797772903 797347870 798828278 798585052 797144318 795067291 795156631 796477432 797581482
1925.9 797581482 798325653 799152145 799601288 799412766 798950577 798194580 797615585 797006683 796908417 796835327
1935.5 796835327 797279816 798193436 798726959 799151230 799166565 799536285 797672653 795037155 795792160
1944.2 795792160 796163177 795873184 796002960 796851730 797974472 798932266 799061127 798726501 798409119
1952.9 798409119 797596664 796992493 796250610 795993423 796154175 796563950 797487488 797890930 798548279 799087830
1962.5 799087830 798999557 798334732 797405319 796384430 795041809 794976730 795864105 796920776 797805328
1971.2 797805328 798190384 798422012 798699188 798011856 796707230 796177292 795514984 795138702 795285110
1979.9 795285110 795531921 796024780 796680908 797422409 797394562 797031937 796053772 794835587 794141083 793816071
1989.5 793816071 794219971 794024658 793769302 795009460 796257248 796660767 796635132 796002884 795016022
1998.2 795016022 794328156 793658600 793575821 793654175 794116058 794873047 795336838 796004562 795883865 795354462
2007.8 795354462 794656372 793928757 793336792 792723160 792692795 792738037 793160400 793784485 793963547 793478775
2017.5 793478775 793322601 793606644 793102112 792440720 791582031 791119308 791257095 791858597 792757645 792869568
2027.1 792869568 793016052 792921143 792371979 791844482 791394653 791067734 790799255 790706558 790559158 790954437
2036.8 790954437 791504288 791932373 792189026 791757660 790958252 790350571 790084534 789289246 789018326 789445038
2046.4 789445038 789656525 790346680 790955353 790834961 790565796 790543976 790024948 789497070 788871613 788020325
2056.1 788020325 788317642 788785248 788914490 789170074 789608154 789668045 789206467 788562546 787534485 787069092
2065.7 787069092 786985550 786814880 786500549 786509476 786952744 787225113 787484741 786907806 785971985 785218582
2075.4 785218582 784465790 783585815 782975693 783105164 783031998 783357162 783595123 783577881 783888321 783759232
2085 783759232 783347015 782675018 782308197 782152023 782008057 781899109 782137604 782995300 783719940 784175491
2094.6 784175491 783807831 783647995 783652344 783098679 782906189 782803802 783126602 783753738 784484329 784983902
2104.3 784983902 785104065 785197906 785071640 785093155 784926834 784604416 784324493 784390030 784629669 785104065
2113.9 785104065 786077499 786368256 786395950 786462936 786236801 785591888 785265579 785366745 784831085 784682617
2123.6 784682617 784821472 784866791 784934845 785159912 785326614 784817734 784825668 784907455 784426041 783978882
2133.2 783978882 784206161 784812622 784788132 784921112 785562515 786044235 785623093 785030060 785125351 785225601
2142.9 785225601 785049820 785017395 785444260 785901794 786431198 786635818 786885071 787374878 787100143 786879272
2152.5 786879272 786890869 786775284 786350479 786051865 786388092 786771927 787098083 787405396 787797012 787934723
2162.1 787934723 788039551 788062057 787713242 787209396 786731720 786787872 786898193 787346878 787707825 787786484
2171.8 787786484 787969513 787456741 787201920 787094269 786684723 786204071 785617752 785552063 785852127 786141434
2181.4 786141434 786535873 787036362 786946564 786601562 786574860 786837769 786947861 786544952 786687241 787098999
2191.1 787098999 787423630 787942657 788693085 789405975 789615936 789647827 789242401 789002533 789169693 789180374
2200.7 789180374 789170151 789440155 790093307 790570221 790724411 790642853 790983276 791284485 791010361 790777588
2210.4 790777588 790615768 790553436 790421143 790820007 791372375 791804199 792073975 792126236 792289200 791617584
2220 791617584 791225510 790907364 790572357 790833588 790774994 791064148 791314774 791638412 791647339 791375351
2229.7 791375351 791612091 791635971 791576691 791099472 790899734 790980530 790799103 790802231 791199417 791833420
2239.3 791833420 791956635 792028809 791733551 791139374 790767746 790496368 790275955 790319748 790893936 790965271
2248.9 790965271 791280365 791861877 791956635 791737747 791220169 790856323 790169830 789980087 790474930 790952835
2258.6 790952835 791056519 791166687 791814728 792366943 792804718 792238770 791577301 790993423 790281830 790475235
2268.2 790475235 790774078 791468353 791742859 791776047 791855698 791941757 792334976 791819763 791424637 791152344
2277.9 791152344 790900192 790731659 790856247 791427231 791843491 792337875 791794205 791437836 791447144 791248093
2287.5 791248093 791193161 790630798 790368423 790068283 790540161 791264572 791733627 792083969 791747971 792029343
2297.2 792029343 791843109 791633835 791474762 791053543 791084442 790762634 791072235 791510925 791739578 791827469
2306.8 791827469 791676254 791420593 791001587 790544052 789723969 790043869 790066528 789653244 789966965 790301971
2316.4 790301971 790851059 790265503 789733505 790185013 790568848 790058670 788872986 787807236 787195129
2325.1 787195129 788115234 788686523 789404984 790259247 789953232 789763336 790127869 789964828 788167496
2333.8 788167496 788266296 789211044 788619308 788581390 789806824 791016159 790376282 791072464 791942978 790507431
2343.4 790507431 789156799 788230438 788281937 789239044 790782547 792655563 794230728 794325256 793471146
2352.1 793471146 792463684 791516495 791008224 789840851 788439102 787804565 788454361 789246140 789660339
2360.8 789660339 790062180 791006241 791812820 789907074 789280319 789743271 788311005 787985077 789569855
2369.5 789569855 790724411 791724625 793114700 793109665 793638458 794395142 793629608 793002853 792687073
2378.2 792687073 792565689 792791595 793441315 794239197 794988098 795496063 795503311 795476990 795490799 795431290
2387.8 795431290 794814377 794201508 794092178 794236374 794846344 795386276 795697098 795654221 795441513 795259628
2397.4 795259628 795200272 794976654 794076080 793607330 793589630 793812943 794569473 795550690 796043549 795636749
2407.1 795636749 795155716 794748001 794287033 793650131 793167038 792813873 792821808 793694305 794117050 794285583
2416.7 794285583 794715805 794942474 794569092 793902435 793223038 792285767 792332916 792870026 793053818 793323746
2426.4 793323746 793836517 794241714 794045792 793945923 793512039 792702332 791951370 791318436 791111603 791119614
2436 791119614 791450806 791962967 792598267 792833557 792810287 792576065 791831360 791271667 790663605 790208130
2445.7 790208130 789947128 790139847 790903854 791760941 792479172 792258835 791555862 790997391 790736542 790066605
2455.3 790066605 789145889 788820724 788955307 789698639 789951324 790080872 790599747 790901642 790723724 789880524
2465 789880524 789265137 788602524 788108292 787965698 788189163 788845825 789214478 789701538 789765854 789488678
2474.6 789488678 789028931 788063126 787153473 786599121 786655960 786867294 787282333 787739182 788085785 788375168
2484.2 788375168 788295212 788044357 787136688 785920944 785257187 784893875 784525604 784801025 785743942 786334152
2493.9 786334152 786568604 786679993 786519928 785910568 785212784 784480591 783736801 783329468 783385315 783962784
2503.5 783962784 784416046 784998016 785406570 785111618 784829712 784551163 783720093 782603149 782396393
2512.2 782396393 782406998 782649536 783672180 784396362 784714584 784498825 784129486 783614655 782631073 781360626
2521.9 781360626 780578842 780699539 780951309 781847916 782901535 783565063 783684082 783223801 782808762
2530.5 782808762 782037354 781374588 780600357 780046387 780247803 780845413 781507416 781659393 782532806 783073578
2540.2 783073578 782210770 781355362 780517502 779727020 779361572 779517746 779948959 780386887 780591660 781101456
2549.8 781101456 781820297 781923141 781454163 780313644 779444809 778871918 778296967 778311996 778658371 778962479
2559.5 778962479 779217148 779946899 780488892 780401154 779816284 778737335 777655334 777120514 777473297
2568.1 777473297 777571030 777727432 778285828 778659973 779230881 779227676 778721390 778033676 777018204 776118240
2577.8 776118240 775726395 775972366 776467133 776965332 777320175 777811737 777989120 777439499 776915207 776466293
2587.4 776466293 775840530 775120316 774703827 774647217 774821548 775328598 775823441 776128311 776267471 775866165
2597.1 775866165 774921799 773878174 773184891 772967987 772860641 773222580 773644257 773791962 774300079
2605.7 774300079 774365997 773951492 773472595 772799225 771949234 771257782 771195984 771408844 771934509 772547607
2615.4 772547607 772773590 772383118 771902771 771499481 770737839 770392075 769916077 769354019 769124527 769133453
2625 769133453 769884109 770446548 770542755 770314178 769914856 769309387 768392410 767599945 766985245 766890488
2634.7 766890488 766955795 767201614 767685471 768215561 768513412 768101959 767503586 766472092 765234680
2643.4 765234680 764447021 764220200 764210587 764431152 765121613 765505829 765959702 766059723 765450516 764616013
2653 764616013 763471069 762751541 762586136 762742310 762802353 763270035 764238358 764349060 763758774 763155899
2662.6 763155899 762531891 761814499 761384811 760870438 760546570 760681992 760907135 761578140 761706009 761612091
2672.3 761612091 761673889 761395569 761036758 760088806 759081955 758457184 758360672 758705750 758840179 759063797
2681.9 759063797 759575577 759819107 759373703 758822556 758151093 757180710 756591568 756508713 756675873 757055511
2691.6 757055511 757278137 757308578 757628403 757314529 756547546 756105652 755308914 754593124 754336548 754443054
2701.2 754443054 754631424 754634171 755079422 755514755 755220642 754965668 754582672 753868637 753384018 752671967
2710.9 752671967 752329636 752280655 752345963 752861176 753041458 753185654 752807236 752323151 751935577 750851364
2720.5 750851364 750095062 749763489 749871063 750123825 750423889 750784073 750867691 750706100 749858246 749011078
2730.2 749011078 748323669 747746353 747309265 746972427 746972122 747404480 748292847 748421402 748269272 748105698
2739.8 748105698 747598953 747136536 746149597 745171204 745033646 745626450 745799255 745968552 746196823 746077576
2749.4 746077576 746371841 745721054 744684982 743742523 742835770 742782822 742628174 742516098 742728500 743152313
2759.1 743152313 743255005 743069077 742809906 742051010 741440659 741062012 740772934 740395508 740219040 740186462
2768.7 740186462 739924774 739753494 739831009 739970245 739536743 739218445 738597946 737537766 736833038 736255188
2778.4 736255188 736405869 736708145 737171021 737451630 736973038 736502380 735853577 735412445 734791336 733824081
2788 733824081 733418884 733666153 733860245 733419800 732922134 732976913 733264008 732576141 731375656 730703430
2797.7 730703430 730052109 729359818 729266281 729440536 729250793 728986206 728684311 728763275 728306732 727198868
2807.3 727198868 726444855 725393372 724898529 724485703 724133911 724209518 723771057 723544388 723240967 722907639
2816.9 722907639 722206955 721245041 720834274 720250778 719339600 718692932 718658676 717951126 717431412 717610168
2826.6 717610168 717279129 716881714 715774689 714605637 713828430 713171692 712527542 711596680 711179504
2835.3 711179504 710754318 710339279 709880447 708966217 707457657 705274963 703726883 702328796 700461044
2843.9 700461044 698912964 697322083 695700684 694633484 692957840 690569687 689204330 688476028
2851.7 688476028 687371826 685957565 685188446 685303650 685579987 686035233 686680222 687032928 686261673
2860.3 686261673 685410233 685043335 684172058 683163757 682454147 682173004 681431580 680137558 679450607
2869 679450607 678908615 678308563 678167801 677814026 676717453 675611343 674669876 673807526 673311462 673059845
2878.7 673059845 672751694 672503662 672533112 672438812 671925278 670991287 670264740 669717712 668774414 667472763
2888.3 667472763 666043549 665716476 665920486 665596008 665144119 664376602 663382187 662267151 661308975
2897 661308975 660454712 659910812 659516144 658698044 658127213 657511292 657001038 656894913 656825409 656297073
2906.6 656297073 655070190 654516068 654215088 653195877 651931534 651025238 650556717 649679260 648706665
2915.3 648706665 647689743 646354141 645173416 644146271 643188782 641676407 640568771 641141891 641662521
2924 641662521 641496735 641406021 641379547 641723862 642001038 641702805 641286392 640975647 640531845 640404358
2933.6 640404358 641108322 642112656 643239288 643911133 644113998 644511414 644667282 644876785 645333252
2942.3 645333252 645832214 646165161 646441650 646899567 646942368 647026138 647375565 647467804 647192078 646643677
2952 646643677 646180649 645790787 645195923 644750061 644872894 644889526 645158920 645672073 645635605 645513382
2961.6 645513382 645427780 645895920 646428299 646542282 646934357 647623215 648707352 649632645 650509262 651772842
2971.2 651772842 652981110 653739166 654118805 654758377 655460739 656141663 657405624 658790436 659504547
2979.9 659504547 660504532 661586075 661888123 662518158 663007278 663254395 663869247 664284134 664839325
2988.6 664839325 665825882 667040863 668032837 668463745 668609543 668816147 669127655 669631195 669990387
2997.3 669990387 669948502 670073700 670237427 670127487 669954453 670177155 670256348 670213623 670656967 670490723
3006.9 670490723 670280075 670464554 670186386 669888916 669897308 669612122 669153214 669188690 669107742 668991013
3016.6 668991013 668600388 668081131 667669754 666547318 666032181 666194839 666572647 666722183 666114273
3025.2 666114273 665480652 664907074 664812241 664071808 663094711 663075562 662850494 662403717 661841507 661651077
3034.9 661651077 661533890 661096039 660899200 660528946 659917145 659111481 658178558 657464066 656906052 656292953
3044.5 656292953 655981064 655904083 655830688 655707092 655268326 654440613 653187637 652427750 652028885 651640930
3054.2 651640930 651061249 650274582 650523529 650439072 649566574 648853302 648279572 647719650 646961365 646237335
3063.8 646237335 645332108 645218506 645371170 644917831 644513626 643918762 643692932 643398743 642724380 642134781
3073.5 642134781 641649170 641192398 640571594 640213547 640012741 640062256 640294189 640042114 639040947 638362427
3083.1 638362427 638060684 637190399 636647339 635904007 634957962 634518814 634282227 634089508 633640747 633296394
3092.7 633296394 632826118 632452011 631620407 630621223 630684738 630575104 630124893 629219666 628199730 627738647
3102.4 627738647 627489662 627345772 626940689 626483765 625922813 625153809 624424896 623855934 623152046 622614250
3112 622614250 622470741 622052383 621496506 620786285 620370636 619751205 618617287 617376289 616122704
3120.7 616122704 616033134 615841904 615135422 614800301 614017143 613085213 612437134 611786995 610665894 609660835
3130.4 609660835 608882751 607881927 607085571 606679649 606082840 605400276 605584602 605449715 604619102
3139 604619102 603659744 602558327 601597366 600677528 600018425 598886261 597705841 596934128 596807060
3147.7 596807060 597130470 596154785 594842987 593727646 592721329 591694450 590325584 589311905 588528824
3156.4 588528824 588292770 588263474 587930031 587027435 585829277 584911385 584016647 582730255 581180840
3165.1 581180840 580517197 579851837 579198875 578674088 577807961 577420654 576180801 574678421 573990364
3173.8 573990364 573786469 573070335 571700554 571305351 570776291 569916611 569216766 568614006 568034706
3182.4 568034706 567083435 566066818 564557076 563380623 562574463 561740570 560948296 560126610 559849739
3191.1 559849739 559516563 558744545 557637329 556821861 555931244 554624634 553559189 552686501 552112045
3199.8 552112045 551401672 550909576 550345345 549520111 548730736 547660789 546814995 545794449 544894676
3208.5 544894676 544017906 543076324 542400780 541819229 541642036 540785103 539765968 539365425 538835678
3217.2 538835678 537915382 536869240 535971985 535091286 534729996 534055519 532991295 532580795 532293549
3225.8 532293549 531685028 531027374 530265121 528954849 527994080 527647858 527363014 526597023 525547714
3234.5 525547714 525046310 524493217 524063683 523453903 522563286 521817856 521013908 520133476 518980408
3243.2 518980408 518276863 517776413 517618561 517616272 516801147 515575523 514620934 514374046 513522224 512473602
3252.8 512473602 512003059 511747589 511514130 510427818 509441490 508788414 508415337 507980080 507235870
3261.5 507235870 506915932 506109161 505112419 504507904 503911285 503077278 503135414 503648834 502909012 502201653
3271.2 502201653 501550484 500764427 499583244 498352356 498297119 497986717 497319069 496731567 496433525
3279.8 496433525 496665077 496551933 495768471 494551811 493360596 492592239 492636566 492338524 491513481
3288.5 491513481 491400299 491501656 491349068 490582466 489489899 489088249 489252014 489143028 488399391
3297.2 488399391 487191811 486252327 485765572 485349045 485294609 485057831 484791527 484598694 483643227 482600327
3306.8 482600327 481971397 481470070 480676537 480142975 479893799 479412613 479170799 478658638 477728958 476960030
3316.5 476960030 476505432 475620461 474495201 473905754 473123856 472704010 472608719 472018585 471481171 470859337
3326.1 470859337 470092239 469468155 468350639 467024117 466666794 466208725 464997787 464286842 464221992
3334.8 464221992 464035034 463493195 462882080 461954613 460841904 459761314 458761368 457968674 457288818
3343.5 457288818 456815758 455936203 455066833 454569740 453767548 453001137 452468643 451893578 450783539
3352.2 450783539 449789581 449438744 448873215 448072357 446968498 445817146 445463448 445216179 444321823
3360.8 444321823 443025742 441779518 441483765 441169243 440061035 439395905 438869286 438270302 437348747
3369.5 437348747 436297569 435919380 435474815 434638481 433691292 433344612 432936401 431788483 430812798
3378.2 430812798 429914856 429268341 428967552 428899803 428668518 427592850 426422157 425979118 425921822 425780144
3387.8 425780144 425653000 425107994 424287796 423528862 422779350 422469177 422157898 422106819 421968193 420844841
3397.5 420844841 420099220 420191460 420281029 419971161 419270668 418979034 419153900 418946075 418218346 417298050
3407.1 417298050 416997757 416825676 416030769 415860100 416620903 417086220 416422958 415649223 415315590 414898415
3416.8 414898415 414645996 414595642 414673996 414175529 413756142 413821106 413932610 414636459 414664650 414330063
3426.4 414330063 414398880 414210205 414297638 414527283 414061165 413566666 414384308 415134392 414973106 414916649
3436.1 414916649 415131645 415361290 415571404 416208076 416568527 416500549 416206894 416204300 416631622 416868896
3445.7 416868896 417490044 417528458 417982712 418929672 418728371 418851242 419594078 420628204 421227036 421354790
3455.3 421354790 422018661 422695198 423081131 423147087 423511124 424232750 424775925 424926491 425418434 426757164
3465 426757164 427629738 427881851 428500099 429735680 430380630 430317116 430664787 431190109 431813049 431979485
3474.6 431979485 432066574 433245125 434828339 435744972 436008797 436449318 437188225 437857857 438627930
3483.3 438627930 439621010 440032768 440105171 440830116 441754074 442566376 443397293 444093666 444605103 445635338
3493 445635338 447176895 448590279 449153938 448679657 449056664 450039330 450550728 451480408 452780113
3501.6 452780113 453518524 453905411 454494781 455429955 456652412 457365036 458031387 458461266 458925323
3510.3 458925323 460412903 461590500 462831039 463816566 464381027 465522499 466609230 466926575 466634293
3519 466634293 467216454 468571930 470174026 471096535 471275177 472554016 473869476 474734230 475612831
3527.7 475612831 476896591 477296028 477363434 478303833 479487038 481037674 482133560 483924255 485256577
3536.4 485256577 485876541 487410011 487950745 488905983 489803810 490480957 491438293 492502556 493860779
3545 493860779 494915504 496709175 497200203 498876076 500521622 501097946 502295074 501275902 502287827
3553.7 502287827 504065628 506241875 508544388 509105377 511232986 512315826 512828026 513854103 515561180
3562.4 515561180 516494331 516508408 519453964 518811989 519262123 522041550 522874832 526247177 528444557
3571.1 528444557 530196762 531542091 533017883 534245644 535056648 536592064 537160759 539912453 541831551
3579.7 541831551 542978096 545227013 546652489 547979813 549009666 552636528 553132629 551092453
3587.5 551092453 552798958 552878761 557150955 561020775 563857422 565246506 566048698 568749428 567035027
3596.1 567035027 569920502 573959999 574549599 577400475 578277245 579450989 582265015 584901924 587128067
3604.8 587128067 589202194 590546608 589335594 592548218 592108688 592280006 599306564 600096245 599868164
3613.5 599868164 604118080 603703575 607741394 611842232 611223221 612237778 612148323 614494057 618332634
3622.2 618332634 621193237 624506531 627627182 629158554 631243210 636636086 633739853 624796104
3629.9 624796104 630749283 637467117 643529358 644188995 643139725 647630920 651925430 653791580
3637.6 653791580 654467697 656386261 658361130 660540237 661774902 662324677 664740448 668130264 673183670
3646.3 673183670 671593246 668904419 674311066 674393692 671837692 672304001 678498001 682686996 685813370
3655 685813370 689432220 683339462 686842346 692554092 694361801 696299515 697114639 698578873 698694611
3663.6 698694611 699709625 701331558 702435684 706692581 706809082 704187088 705654373 701149902
3671.4 701149902 704258194 711648712 717798538 713477249 696254501 701782303 710781860 716078796
3679.1 716078796 715457687 716759567 719957733 721015701 721656723 722145844 722673111 725563736 729806824
3687.8 729806824 720911102 717241440 725243073 721471786 722057648 726937866 726476212 727261810 726688843
3696.4 726688843 726196976 727571869 728048019 730647507 732672729 728019257 727242737 732364883 733673553
3705.1 733673553 733172455 733668900 735789795 738355408 731037598 734759598 738934250 727627945
3712.8 727627945 732781448 737666855 738031769 738846207 740384369 740343857 737181549 738477097 743385925
3721.5 743385925 739934235 736948471 741982498 742085114 741431808 739519501 740289764 744034805 744207764
3730.2 744207764 748428497 743481445 736385574 745492783 745810776 737797470 738576889 741066818 741735306
3738.9 741735306 744348297 746445312 742026672 745138245 755987549 743071442 727947235 739887772
3746.6 739887772 746028442 751026306 745427475 733562546 743509445 738216248 735394211 743216553
3754.3 743216553 747791367 750080795 745286560 748505936 753382034 745599518 744934540 749414673
3762 749414673 750185928 749311981 751307220 748019028 745327835 749291840 753138504 752451553 743605804
3770.7 743605804 746436310 751100769 751582489 752271957 752066498 753072662 753314972 754248276 752238770
3779.4 752238770 745889969 749460144 751884232 752611771 754159927 751162262 750144958 751059647 751500320
3788 751500320 752035141 752493591 753362427 753292542 753480606 753130264 753853989 755675888 749920959 746516953
3797.7 746516953 750112000 753787460 757616119 748998260 739812698 746219330 749946671 753916168
3805.4 753916168 758701630 749479294 746188660 750885239 752820816 753424911 753721542 753474808 754197922
3814.1 754197922 758711243 755114441 742876740 749540710 755261765 758387299 756411972 738220291
3821.8 738220291 741720886 749212265 753026199 755539474 754652786 750394974 751680832 754816360
3829.5 754816360 757392654 756111145 747377548 750493774 756346970 750537338 750930557 758501663
3837.2 758501663 747800064 743437805 751366272 746552582 747855453 754165115 751625061 749271774
3844.9 749271774 752426529 754136581 753687592 754863281 753432236 755029984 758768616 749519577
3852.7 749519577 749785461 737432938 742204285 753177032 752625656 751735687 753508606 755042877
3860.4 755042877 756154099 749727631 750249786 756438675 750425415 747195358 752012405 755880966
3868.1 755880966 759619980 750796509 743591461 748618469 754582291 756024399 746623383 749296112
3875.8 749296112 753745041 754023972 755776520 757643967 751721497 747031860 753010635 754190598
3883.5 754190598 755714951 758630829 745511169 748343124 753138504 754090042 757810669 755830536
3891.2 755830536 748655090 750825043 754163513 753295059 754371033 754371185 755393219 756818924 748642273
3899.9 748642273 752305145 751853638 746631546 751298141 747551804 746796417 749729996 751558609 753083420
3908.6 753083420 752872849 753964386 754542923 755166168 755283508 753853760 753893433 754437866 751318741
3917.3 751318741 749653473 753763046 754100723 751622009 753349228 754153595 754306488 751895752 749864578
3926 749864578 752442780 754475555 754629135 752695389 752270737 753406830 750999374 750290756 751916275
3934.6 751916275 752520905 753072586 753044357 752976227 753809586 753799438 754630585 754741364 750842133 751198196
3944.3 751198196 752782669 752680435 752857666 750918350 751481705 751616821 750142365 752396774 753328857
3953 753328857 753321304 753521500 752696762 752503738 752640228 753128738 752933426 753315582 753711548 752505112
3962.6 752505112 752705231 752979355 752661514 753322525 753531113 753028259 752610550 752685394 753187866 753340530
3972.2 753340530 753529587 753405685 752880707 752797394 752711716 752982101 753081894 752693024 753040161 753803177
3981.9 753803177 753577728 752958679 752876892 752271576 752549438 753484497 753405533 753354111 753022995 752790070
3991.5 752790070 753219223 753855667 753492203 752625885 753178101 753702240 753214188 752491989 752825470
4000.2 752825470
##END=$$ End of the data block
