##TITLE=$$ Begin of the data block
##JCAMP-DX=5.00 $$ ACD/SpecManager v 10.08
##SPECTROMETER/DATA SYSTEM=Varian
##DATE=07 Jan 2013 17:14:00
##DATA TYPE=INFRARED SPECTRUM
##DATA CLASS=XYDATA
##ORIGIN=
##OWNER=
##NPOINTS=3735
##FIRSTX=399.26403809
##LASTX=4000.35498047
##MAXX=4000.35498047
##MINX=399.26403809
##MAXY=80.04962921
##MINY=18.50760269
##XFACTOR=1.0000000000
##YFACTOR=0.000000100000000
##FIRSTY=62.47145844
##DELTAX=0.96440572
##XUNITS=1/CM
##YUNITS=TRANSMITTANCE
##XYDATA=(X++(Y..Y))
399.3F24714584q319587p380181o358947J035575J0383835L599892r92546M303627
$$ 624714584 616394997 609014816 602655869 603691444 614075279 617675171 616682625 620986252
407F20986252K543602k271843m049530q352738J646996O771736m328689L183364R504662
$$ 620986252 623529854 621258011 617208481 608855743 610502739 617274475 612945786 616129150 625633812
415.7F25633812M350777L040466P10297j5116501r933472M462967o45485m673805k833290
$$ 625633812 629984589 633025055 633735352 618618851 608685379 613148346 612502861 607829056 604995766
424.3F04995766m963684N031585Q603516O162529J548576n398140o218338k906074
$$ 604995766 600032082 605063667 613667183 619829712 621378288 615980148 609761810 606855736
432.1F06855736k048111q90961N461655K219085k77671P017440K212220k766915k001419
$$ 606855736 604807625 603916664 609378319 611597404 611319733 618337173 620549393 617782478 615781059
440.7F15781059m888687j787338m68636j820984J291314J358833N607681L193512k560196
$$ 615781059 610892372 609105034 608636398 606815414 608106728 609465561 615073242 618266754 615706558
449.4F15706558J7662j376228n291824p984925n563698P8087M087868N663529J661186
$$ 615706558 615724220 614347992 609056168 601071243 595507545 595585632 599673500 605337029 606998215
458.1F06998215K94990j640396l770599j949921k154770j306267l420562j426659K947464
$$ 606998215 607293205 605652809 601882210 599932289 597777519 596471252 593050690 591624031 594571495
466.8E94571495k127304j554718R994659Q297577k715378q606834l818169j85203N44853
$$ 594571495 592444191 590889473 600884132 609181709 606466331 597859497 594041328 593856125 594400978
475.5E94400978J81046j615105L089752M635239M57687L142777M328537l434906q337365
$$ 594400978 594582024 592966919 596056671 600691910 601149597 604292374 608620911 605186005 596848640
484.1E96848640R53675K267189k528076J722717L780250K817307K355690J589584j689834
$$ 596848640 597802315 600069504 597541428 599264145 603044395 605861702 608217392 609806976 608117142
492.8F08117142k267571q53576l662606l504905m1428L704071K226219n34019J390876
$$ 608117142 605849571 604995995 601333389 597828484 597787056 601491127 603717346 603183327 604574203
501.5F04574203J067544m52004j188240l480835n747986l322868o98395J373138M293595
$$ 604574203 605641747 605189743 604001503 600520668 594772682 591449814 590751419 592124557 596418152
510.2E96418152j794472j855812p63054j568680J59455j797829j585197n277367m301910
$$ 596418152 594623680 592767868 592004814 590436134 590595589 588797760 587212563 581935196 577633286
518.9E77633286k92283k47688R30939K479133L480568K03705j309128j151657j806144
$$ 577633286 577341003 577093315 578024254 580503387 583983955 584187660 582878532 581726875 579920731
527.5E79920731j612053n35317J3390k474938n0239L483658L614349Q37669k134475
$$ 579920731 578308678 577773361 577786751 575311813 575261574 578745232 582359581 583197250 581062775
536.2E81062775k208748k995568k556381j859207J89629L081588M106102K354737P66487
$$ 581062775 578854027 575858459 573302078 571442871 571632500 574714088 578820190 581174927 581941414
544.9E81941414K146759J589279k48032k637748j725617M99497M45747J214218j906967
$$ 581941414 584088173 585677452 585429420 582791672 581066055 581565552 582011299 583225517 581318550
553.6E81318550p30057L535576K543640L18833j939278j480064j293793k099457j955604
$$ 581318550 580588493 584124069 586667709 586986542 585047264 583567200 582273407 580173950 578218346
562.3E78218346K68364K901191K221031Q11043O66313J235619M36668j475372k746315
$$ 578218346 578486710 581387901 583608932 584419975 585086288 586321907 586758575 585283203 582536888
570.9E82536888k417030j201859q70399L40957O88744R52034O58073Q81272J199341
$$ 582536888 580119858 578917999 578047600 578388557 579077301 580029335 580687408 581568680 582768021
579.6E82768021j291619k941208j598205J53923o84815p35855J224289J611481Q60367
$$ 582768021 581476402 578535194 576936989 577090912 576406097 575670242 576894531 578506012 579366379
588.3E79366379R21898J453476j75629l45383j082153k408791o17904M84314j05400
$$ 579366379 580288277 581741753 581566124 581220741 580138588 577729797 577111893 577596207 577490807
597E77490807l59803J874466Q47130k397613l185845m301834l579445l427811l585166
$$ 577490807 577131004 579005470 579852600 577454987 574269142 569967308 566387863 562960052 559374886
605.6E59374886o308175p460136n254021q704338j1651153j2496682j2106170j2681923
$$ 559374886 553066711 545606575 540352554 531648216 519997063 507500381 495394211 482712288
613.4D82712288j0138435m854393k135277O85310J132698j33285n143090p898483r626541
$$ 482712288 472573853 467719460 465584183 466269493 467402191 467268906 462125816 454227333 444600792
622D44600792j2465248r048386j751900Q020440J3897285J7587242J6885834J4744568
$$ 444600792 432135544 423087158 421335258 429355698 443252983 460840225 477726059 492470627
629.8D92470627J2255554P634430K433243j564102l828087q575859r700432q465843
$$ 492470627 504726181 512360611 514793854 513229752 509401665 500825806 491125374 482659531
637.5D82659531n975113j914711K310791J0698547J4747391J8391151J9168129J7381630
$$ 482659531 476684418 474769707 477080498 487779045 502526436 520917587 540085716 557467346
645.2E57467346J4046898R501000O457138L740425K835693K457275K642937L663712
$$ 557467346 571514244 581015244 587472382 591212807 594048500 596505775 599148712 602812424
652.9F02812424L464851K765503K043114J604347Q14400o52619l16581M5776j364937
$$ 602812424 606277275 609042778 611085892 612690239 613504639 612852020 612535439 612581215 611216278
661.6F11216278L3798L426132L170968K162857K600708J503944n051575N89486Q05625
$$ 611216278 611250076 614676208 617847176 620010033 622610741 624114685 619063110 619652596 620458221
670.3F20458221j90P77092K08168l18260J039505L874473M365158J644364R4909j53160
$$ 620458221 620458031 621235123 621443291 621125031 622164536 626039009 630404167 632048531 632143440 631990280
679.9F31990280j422958k372170j422043l79333N05104J372414M28924R6283L37906
$$ 631990280 630567322 628195152 626773109 626393776 626898880 628271294 628700218 628796501 629134407
688.6F29134407k40478r05800k922669l267784k357254k995911k108497J26533J564255
$$ 629134407 628893929 627988129 625065460 621797676 619440422 616444511 614336014 614462547 616026802
697.3F16026802J199188o5841P4195N990j352425j372681o55212p80296m85077L89557
$$ 616026802 617225990 617160149 617234344 617240334 615887909 614515228 613860016 613079720 612594643 612984200
706.9F12984200K101745L958244L993760K250709J468163J348114r1210j02615M78668
$$ 612984200 615085945 619044189 623037949 625288658 626756821 628104935 628013725 627911110 628389778
715.6F28389778P8240J765174L182373L169556L736229K818375J496582P99713p50275
$$ 628389778 628468018 630233192 633415565 636585121 640321350 643139725 644636307 645436020 644685745
724.3F44685745j939010j818848j590118l93448N67550O10810J655273J954117J255722
$$ 644685745 642746735 640927887 639337769 638944321 639511871 640122681 641777954 643732071 644987793
733F44987793m54407k548446l240929j894951j067734k485237l58925K850609L070603
$$ 644987793 644533386 641984940 638744011 636849060 635781326 633296089 632937164 635787773 638858376
741.6F38858376K370872J478195J188812M73176N88073K68326j4343R96704J422577
$$ 638858376 641229248 642707443 643896255 644369431 644957504 645225830 645211487 646208191 647630768
750.3F47630768L083954M086532N482636N511169L350067K883606O01502l59574o79931
$$ 647630768 650714722 654801254 660283890 665795059 669145126 672028732 672630234 672270660 671590729
759F71590729j196594L37677J625213L043823K895584K426529J811600J5946j577530
$$ 671590729 670394135 670731812 672357025 675400848 678296432 680722961 682534561 682550507 680972977
767.7F80972977l390045l756791k463379j293640N96390J792603K179641M227677M470138
$$ 680972977 677582932 673826141 671362762 670069122 670665512 672458115 674637756 678865433 683335571
776.4F83335571K996598J486587o50711o91147j299972q47550J779404K999878L526153
$$ 683335571 686332169 687818756 687168045 686476898 685176926 684329376 686108780 689108658 692634811
785F92634811L819504M138031K996674Q43582j367722k688522k129974j081467j222610
$$ 692634811 696454315 700592346 703589020 704432602 703064880 700376358 698246384 697164917 695942307
793.7F95942307l23945K529908K981643L252411K912598J201935n38941l540725l792649
$$ 695942307 695618362 698148270 701129913 704382324 707294922 708496857 707957916 704417191 700624542
802.4G00624542k783508j329422L05633J421052K426147L647995M560928J991959k8687
$$ 700624542 697841034 696511612 696817245 698238297 700664444 704312439 708873367 710865326 710836639
811.1G10836639k087020l998490l746872k610779l63082L36532K655716M315262L411941
$$ 710836639 708749619 704751129 701004257 698393478 698030396 698366928 701022644 705337906 708749847
819.7G08749847K562561L6622j723557l289947l744507l177796k858581j329727O29425
$$ 708749847 711312408 711349030 709625473 706335526 702591019 699413223 696554642 695224915 695854340
828.4F95854340J608505J249924K05612j605301l765030n667114o216736n972977n461960
$$ 695854340 697462845 698712769 698918381 697313080 693548050 687880936 681664200 675691223 670229263
837.1F70229263m378586j810379M78440K02408j06812r56192k128067l184433m512863
$$ 670229263 665850677 664040298 664518738 664721146 664614334 663658142 661530075 658345642 653832779
845.8F53832779m068985l423309j931763J943054M964066N231476N264358N336456
$$ 653832779 649763794 646340485 644408722 646351776 651315842 656547318 661811676 667148132
853.5F67148132M118119K496719k96555k212295j231690O76575K397766L964234N948639
$$ 667148132 671266251 673762970 673466415 671254120 670022430 670699005 673096771 677061005 683009644
862.2F83009644N976486M322586K278824m4403j520462k548295k741622k933808p00378
$$ 683009644 688986130 693308716 695587540 695543137 694022675 691474380 688732758 685798950 685098572
870.9F85098572K215347M039154N394364M643249K957001J89743j904831l729553m110031
$$ 685098572 687313919 691353073 696747437 701390686 704347687 704537430 702632599 698903046 694793015
879.5F94793015l435517l724747j860656L46527K020416K645111J433716p55920l017197
$$ 694793015 691357498 687632751 685772095 686118622 688139038 690784149 692217865 691461945 688444748
888.2F88444748m467163m636383l902588l352814P6599K352372K929229M811402M202880
$$ 688444748 683977585 679341202 675438614 672085800 672162399 674514771 677444000 682255402 686458282
896.9F86458282K419434L44772j762313l846665m086685k979736k444840N9281J930007
$$ 686458282 688877716 689222488 687460175 683613510 679526825 676547089 674102249 674161530 676091537
905.6F76091537K748642K079087l57590k291794m182510n959931o687240n184021l962174
$$ 676091537 678840179 680919266 680561676 678269882 674087372 668127441 661440201 656256180 652294006
914.3F52294006k338867n07202L77731P59659k54974j461945l576431n362320o308212
$$ 652294006 649955139 649447937 649825668 650585327 650330353 648868408 645291977 639929657 633621445
922.9F33621445o162148l930435k345581p93419J314926K567139K283020P19337k17552
$$ 633621445 627459297 623528862 621183281 620389862 621704788 624271927 626554947 627274284 627056732
931.6F27056732j604347k156372j650467j090660R39751L002510N256805O704330O738511
$$ 627056732 625452385 623296013 621645546 620554886 621494637 624497147 629753952 636458282 643196793
940.3F43196793O021576M720001L264160N39780j117249j259842q6670K437821M105301
$$ 643196793 649218369 653938370 657202530 657742310 656625061 655365219 655278549 657716370 661821671
949F61821671N236511N324402M021759K301330m7760k581024m546585n232239m202423
$$ 661821671 667058182 672382584 676404343 678705673 678657913 676076889 671530304 666298065 662095642
957.7F62095642k776260n61981N88684N36804N93796n03235k458191m765015n901642
$$ 662095642 659319382 658757401 659346085 659882889 660476685 659973450 657515259 652750244 646848602
966.3F46848602o245956n565643k790490o47583L58734J628380J907082J163673n16624
$$ 646848602 640602646 635037003 632246513 631598930 631957664 633586044 635493126 636656799 636140175
975F36140175k500763l703880m076310l260383k776413j545677O98356J134529O86074
$$ 636140175 633639412 629935532 625859222 622598839 619822426 618276749 618975105 620109634 620795708
983.7F20795708k61383j054802l269158o219940o446838n542832m918480n337600n383606
$$ 620795708 620534325 619479523 616210365 609990425 603543587 598000755 593082275 587744675 582361069
992.4E82361069o426430r743118j3845101j2307853k59362J0205155J1075134N273476
$$ 582361069 575934639 566191521 552346420 540038567 539779205 549984360 561059494 566332970
1000.1E66332970R19304k05422j3428Q12073J069718K293357J707650M1847j749458
$$ 566332970 567252274 567046852 567033424 567845497 568915215 571208572 572916222 572958069 571208611
1008.8E71208611l778801m206696m546318l626175k501450p89718M51202l52554q73795
$$ 571208611 567429810 563223114 558676796 555050621 552549171 551759453 552210655 551858101 550984306
1017.5E50984306m88662j049080m065857n680161n344391m228324l258400j785698
$$ 550984306 550495644 549446564 545380707 539700546 534356155 530127831 526869431 525083733
1025.2E25083733k83547k37045O34460n58242j626587l183327m627266l781281l763732
$$ 525083733 524800186 524563141 525197601 524639359 523012772 519829445 515202179 511420898 507657166
1033.8E07657166l057061k263756J15929L41263J97258J165848K91595J19515k186661
$$ 507657166 504600105 502336349 502452278 502793541 502990799 504156647 504448242 504567757 502381096
1042.5E02381096l609581l228874j315003J25084N02968K338486K850723L546600K446022
$$ 502381096 498771515 495542641 494227638 494352722 494855690 497194176 500044899 503591499 506037521
1051.2E06037521Q27942j390114k317771j232758j397286l77426k86712J267471K036095
$$ 506037521 506865463 505475349 503157578 501924820 500527534 500150108 499863396 501130867 503166962
1059.9E03166962J690216J560020K63519p29141l041610l237916k846412j315537l03421
$$ 503166962 504857178 506417198 506680717 505951576 502909966 499672050 496825638 495510101 495206680
1068.6D95206680l34243J187286O53458J025772K91786r63516l114434l794441k777328
$$ 495206680 494872437 496059723 496713181 497738953 498030739 497067223 493952789 490158348 487381020
1077.2D87381020k894707j74675P2098R29260J226540J083602J072350j457138j978989
$$ 487381020 484486313 484311638 484383736 485312996 486539536 487623138 488695488 487238350 485259361
1085.9D85259361l672027m539147n713157m263726k161712l306008l212890n871125
$$ 485259361 481587334 477048187 471335030 467071304 464909592 461603584 458390694 452519569
1093.6D52519569o850547r249039j0968666j1029740j1946220j0862274j1796532j0202446
$$ 452519569 445669022 436419983 425451317 414421577 402475357 391613083 379816551 369614105
1101.4C69614105j0568619r626121r807930j0271263r600716j1641388r471473j0931302
$$ 369614105 359045486 349419365 339611435 329340172 319739456 308098068 298626595 287695293
1109.1B87695293j0082817j0220546q271389o017552o493206k393894l545342n42755
$$ 287695293 277612476 267391930 259120541 253102989 246609783 244215889 240670547 240127792
1116.8B40127792j065120p63607N00450O4049K716960J402302L511639J251602K453270
$$ 240127792 239062672 238299065 238799515 238863564 241580524 242982826 246494465 247746067 250199337
1125.5B50199337K236195J009407K230873l85838J824341j733818k386723l611602
$$ 250199337 252435532 253444939 255675812 255289974 257114315 255380497 252993774 249382172
1133.2B49382172m258614k565899l957767j480351m306946k415084l089467l852825
$$ 249382172 245123558 242557659 238599892 237119541 232812595 230397511 227308044 223455219
1140.9B23455219l671646n650463l492222n729370l111896n045357l860359j839199
$$ 223455219 219783573 214133110 210640888 204911518 201799622 196754265 192893906 191054707
1148.6A91054707l078042o49986k148151Q93516r96017P60956J178226J87607K594833
$$ 191054707 187976665 187326679 185178528 186072044 185076027 185836983 187015209 187202816 189797649
1157.3A89797649J154499M162140K366982L667736L100490L666707N241012L180809
$$ 189797649 190952148 195114288 197481270 201149006 204249496 207916203 213157215 216338024
1165B16338024N216885L595638O112881N562038O794396Q032016P430706R533158P725696
$$ 216338024 221554909 225150547 231263428 236825466 243619862 251651878 259082584 268615742 276341438
1173.7B76341438R770680Q034534Q581372Q573875P932033R345322Q417473J0143318
$$ 276341438 286112118 294146652 302728024 311301899 319233932 328579254 336996727 347140045
1181.4C47140045Q487930J0009156R151306Q286819Q357811N533257N617561L943138
$$ 347140045 355627975 365637131 374788437 383075256 391433067 396966324 402583885 406527023
1189.1D06527023N211373M926414N853157O897850N956345O865730N648728O660232
$$ 406527023 411738396 416664810 422517967 429415817 435372162 442237892 447886620 454546852
1196.8D54546852N138435M697114M591903L830681M692154M339828O542435O257935
$$ 454546852 459685287 464382401 468974304 472804985 477497139 481836967 488379402 494637337
1204.5D94637337O313400N589561M079705L606758J703911J500244Q51250K247657
$$ 494637337 500950737 506540298 510620003 514226761 515930672 517430916 518282166 520529823
1212.3E20529823L190346K897339L569984M116135L992500J682129Q57048O8360m05465
$$ 520529823 523720169 526617508 530187492 534303627 538296127 539978256 540835304 540903664 540498199
1220.9E40498199j512794j933937J75476R33266K057571J958313L000832K326240j9836
$$ 540498199 538985405 537051468 537226944 538160210 540217781 542176094 545176926 547503166 547483330
1229.6E47483330j21498j243058j333313j397056m00925P47681J741638K940712K657928
$$ 547483330 547361832 546118774 544785461 543388405 542987480 543735161 545476799 548417511 551075439
1238.3E51075439K705307J421509N21622p29981j676139j675148j316681L99818J347275
$$ 551075439 553780746 555202255 555723877 554993896 553317757 551642609 550325928 550725746 552073021
1247E52073021K435493K145958K318459J710091L52287m4556j399727j459655j743737
$$ 552073021 554508514 556654472 558972931 560683022 561035309 560990753 559591026 558131371 556387634
1255.7E56387634m29916J232376J950035K639885K463455K456017O96602J31340o87332
$$ 556387634 555957718 557190094 559140129 561780014 564243469 566699486 567396088 567527428 566840096
1264.3E66840096j329117q06618n43137J303063J755028K733688L195610L195190K857247
$$ 566840096 565510979 564704361 564161224 565464287 567219315 569953003 573148613 576343803 579201050
1273E79201050J665954J172486k95296n53169k46811P67784K309914L685608M446373
$$ 579201050 580867004 582039490 581744194 581191025 580944214 581711998 584021912 587707520 592153893
1281.7E92153893L351707L106880K324715J254654L69568k98424O0005P25403J822586
$$ 592153893 595505600 598612480 600937195 602191849 602561417 602262993 602322998 603048401 604870987
1290.4F04870987K642441M169616M333191L355980K591553J232796L45344m90036q91800
$$ 604870987 607513428 611683044 616016235 619372215 621963768 623196564 623541908 623051872 622160072
1299F22160072j70326P05834J508102K467461L163604L161660K236061N63964l86352
$$ 622160072 621989746 622695580 624203682 626671143 629834747 632996407 635232468 635796432 635410080
1307.7F35410080j108551r23920j64146n55077J26801J508217K462768K966080J870613
$$ 635410080 634301529 633377609 633213463 632658386 632785187 634293404 636756172 639722252 641592865
1316.4F41592865O37207n5542p96432j022110q29850m7416P11937J371231K384414
$$ 641592865 642230072 642174530 641378098 640355988 639526138 639478722 640190659 641561890 643946304
1325.1F43946304K567368J967697J414185O82602p32804j500015j528092j337814n75790
$$ 643946304 646513672 648481369 649895554 650578156 649845352 648345337 646817245 645479431 644903641
1333.8F44903641N34134J086578J185684J436005J132889L2806q24203m54407m48532
$$ 644903641 645437775 646524353 647710037 649146042 650278931 650311737 649487534 649033127 648584595
1342.4F48584595j509018r79843P782O12259J861572J878662Q88061L16239l91541
$$ 648584595 647075577 646095734 646103516 646715775 648577347 650456009 651344070 651660309 651268768
1351.1F51268768j548538j771164j743469j747665r09348K13089R83047J290513J373138
$$ 651268768 649720230 647949066 646205597 644457932 643548584 643761673 644744720 646035233 647408371
1359.8F47408371L13263o14548j511917k711563q23135j177292j360588r93081o05888
$$ 647408371 647721634 647107086 645595169 642883606 642060471 640883179 639522591 638529510 637923622
1368.5F37923622J134262R53331M47617j98136j689033l583489k531623l90129m79279
$$ 637923622 639057884 640011215 640458832 640260696 638571663 634988174 632456551 632066422 631587143
1377.2F31587143q77113J3198R95446J058845R73358O33622k32277p75261n81627q17986
$$ 631587143 630710030 630723228 631718674 632777519 633750877 634384499 634152222 633376961 632795334 631977348
1386.8F31977348j908989O82984J399269N46913R67484J171417Q01849j739120k758065
$$ 631977348 630068359 630751343 632150612 632697525 633665009 634836426 635638275 633899155 631141090
1395.5F31141090K61994o11305j922341k745857k70691J235619L83415M2305m21868
$$ 631141090 631403084 630791779 628869438 626123581 625852890 627088509 627471924 627514229 627092361
1404.2F27092361j014709J89552J0033j323013j719780j430168q87070l24211L28941
$$ 627092361 626077652 626267204 626277237 624954224 623234444 621804276 620917206 620592995 620921936
1412.8F20921936J026306P44171N1957o55098r67675o11725m473991P43523K782402
$$ 620921936 621948242 622692413 622744370 622089272 621121597 620509872 616035881 616779404 619561806
1421.5F19561806J87263m37584O41442K317619K082901P62634Q42285m70237j398964
$$ 619561806 619749069 619311485 619952927 622270546 624353447 625116081 625958366 625488129 624089165
1430.2F24089165L22418O97250K28615M43535J389198K62566j051216L359947L257751
$$ 624089165 624411583 625108833 625337448 625780983 627170181 627432747 626381531 629741478 632999229
1438.9F32999229J341439J2932l07198K3842P67898M22287J162033J072922P8469K83699
$$ 632999229 634340668 634353600 634046402 634070244 634838142 635260429 636422462 637495384 637573853 637857552
1448.5F37857552J959991J958962k39792p97806j53732L9749n30167j87073j771354
$$ 637857552 639817543 641776505 641536713 640738907 640585175 640624924 640094757 639907684 638136330
1457.2F38136330j137200N643311M645004L750687J776504K30026Q70209l213196K07520
$$ 638136330 636999130 642642441 647287445 651038132 652814636 653044662 653914871 650701675 650909195
1465.9F50909195K851868K351532K070846J680222J766205q87299j445084K555771
$$ 650909195 653761063 656112595 658183441 659863663 661629868 660742569 659297485 661853256
1473.6F61853256M886551L706436N7907J888886L121796K228622J816864J490936J882630
$$ 661853256 666739807 670446243 670504150 672393036 675514832 677743454 679560318 681051254 682933884
1482.3F82933884J474075O08520R3384l14636j818390j322174J001587j413803M272
$$ 682933884 684407959 685016479 685109863 684795227 682976837 681654663 682656250 681242447 681246719
1491F81246719K798157K159271K93961o69861j819382o652145J654205k30941k281418
$$ 681246719 684044876 686204147 686498108 685828247 684008865 677356720 679010925 678779984 676498566
1499.6F76498566J579361k17896p53097q26874j72653k328873j2670288n809097K999191
$$ 676498566 678077927 677860031 677106934 676280060 676107407 673778534 661108246 655299149 658298340
1508.3F58298340L038864k89230Q33969j605225j757355K82288k033997j941604n321808
$$ 658298340 661337204 661047974 661881943 660276718 658519363 658801651 656767654 654826050 649504242
1517F49504242j112289L774948J586380n464783o252060L057480K452011J086197k839356
$$ 649504242 648391953 652166901 653753281 648288498 642036438 645093918 647545929 648632126 645792770
1525.7F45792770L9902P1411j885681N71671O32248r74122k175979k004471k687912
$$ 645792770 645832672 645904083 644018402 644590073 645222321 644248199 642072220 640067749 637379837
1534.3F37379837J586914Q83827j65977K87666q887863o736946L783226J236534J72653
$$ 637379837 638966751 639850578 639684601 639972267 631084404 624347458 628130684 629367218 629539871
1543F29539871K054138J005593l63045L025627J147194L929j815224l04718L022156
$$ 629539871 631594009 632599602 632236557 635262184 636409378 636413307 634598083 634293365 637315521
1551.7F37315521R63745R07288j954422Q82225L156853P59887n274734r131775Q096809
$$ 637315521 638279266 639186554 637232132 638114357 641271210 642031097 636756363 627624588 635721397
1560.4F35721397O312905M159927J964569k4948n64117Q79745J684036K28653j183319
$$ 635721397 642034302 646194229 648158798 648133850 647569733 648449478 650133514 650362167 649178848
1569.1F49178848m056396L380813K938233k44293n3788l2425j238174p063141K290726
$$ 649178848 645122452 648503265 651441498 651197205 651143417 651110992 649872818 642809677 645100403
1577.7F45100403K046966o97250o23932j451340j028213j621246p26548j120681j855050
$$ 645100403 647147369 646450119 645826187 644374847 643346634 641725388 640998840 639878159 638023109
1586.4F38023109j676178k639198k003860k918396j641045k372513k147293k117882
$$ 638023109 636346931 633707733 631703873 628785477 627144432 624771919 622624626 620506744
1594.1F20506744k925987j274109k626228k035294l124733k371559k733383l330269
$$ 620506744 617580757 616306648 613680420 611645126 608520393 606148834 603415451 600085182
1601.9F00085182k326088l397026j171455j919251j898193l247376k159652k180023
$$ 600085182 597759094 594362068 593190613 591271362 589373169 586125793 583966141 581786118
1609.6E81786118l513489j193505l304977j861649l356285j890106k582931q953362
$$ 581786118 578272629 577079124 573774147 571912498 568556213 566666107 564083176 555129814
1617.3E55129814K862282l16048n47180k401276j686630l698540n133361J351089j174507
$$ 555129814 557992096 557676048 557128868 554727592 553040962 549342422 544209061 545560150 544385643
1626E44385643m95529l927231p78961J00632j189576p62100k184296M04854j441002
$$ 544385643 543890114 539962883 539183922 539284554 538094978 537332878 535148582 535553436 534112434
1634.6E34112434n698623k401467J320725R03702L09715J267128r25369J034317r37691
$$ 534112434 528413811 526012344 527333069 528236771 528546486 529813614 528888245 529922562 528984871
1643.3E28984871O62842M93622m552880m32853n63889M872360J764374K860603K131005
$$ 528984871 529647713 530141335 525588455 525155602 524591713 529464073 531228447 534089050 536220055
1652E36220055j0112534n35507O243400O221276J578407K064323J306038J452866J841354
$$ 536220055 526107521 525572014 531815414 538036690 539615097 541679420 542985458 544438324 546279678
1660.7E46279678J414910K568397O90193M265290K550049K114791J886750K58331k09274
$$ 546279678 547694588 550262985 550953178 555218468 557768517 559883308 561770058 562028389 561819115
1669.4E61819115J000900M253197K240295M406853L993187J019630J357041L496246
$$ 561819115 562820015 567073212 569313507 573720360 577713547 578733177 580090218 583586464
1677.1E83586464L773155J316033J634635J318055L931274L239212l313522O03294
$$ 583586464 587359619 588675652 590310287 591628342 595559616 598798828 595485306 596088600
1684.8E96088600O095009P763710L536606K077179L305702K943573M012070K575111
$$ 596088600 602183609 609947319 613483925 615561104 618866806 621810379 625822449 628397560
1692.5F28397560L422585L495597K126427j366844N950661O975326N489197M003525
$$ 628397560 631820145 635315742 637442169 636075325 642025986 649001312 654490509 658494034
1700.2F58494034m343033P653732N335236K347183K581024L224259L907394M643860
$$ 658494034 654151001 661804733 667139969 669487152 672068176 675292435 679199829 683843689
1707.9F83843689M891129K107086J023101K234574J752624J561203j485901M99955
$$ 683843689 688734818 690841904 691865005 694099579 695852203 697413406 695927505 696427460
1715.6F96427460M216003Q00781k150650O506653N046845K043991R43298j78070M22592
$$ 696427460 700643463 701444244 699293594 705800247 710847092 712891083 713834381 713656311 714078903
1724.3G14078903J542587R07593J369858J858749J133728j564025R05456L301392N38864
$$ 714078903 715621490 716529083 717898941 719757690 720891418 719327393 720232849 723534241 724073105
1733G24073105o148758m057694O880112M542008J835479K370911k24228k65121L719177
$$ 724073105 717924347 713866653 720746765 725288773 727124252 729495163 729270935 729005814 732724991
1741.7G32724991J334305j477204J705628K868881M22897J16043N16739K232666N080109
$$ 732724991 734059296 732582092 734287720 737156601 737579498 737695541 738212280 740444946 745525055
1750.4G45525055Q72040J056823M912949K502365J134720M37622k042007J028747K255478
$$ 745525055 746397095 747453918 752366867 754869232 756003952 756441574 754399567 755428314 757683792
1759G57683792K570191K310409k610321J160049M107514J445999M73862N28869q43582
$$ 757683792 760253983 762564392 759954071 761114120 765221634 766667633 767141495 767670364 766826782
1767.7G66826782k869034K522355K562713k020569k407074J270752N075150J921844
$$ 766826782 763957748 766480103 769042816 767022247 764615173 765885925 770961075 772882919
1775.4G72882919r61990J297302j23901J08948j012421j154022K180938K673188J716613
$$ 772882919 771920929 773218231 773094330 773203278 772190857 771036835 773217773 775890961 777607574
1784.1G77607574o63986L80173J583633P7515o97250l55683j107330p04651k229996
$$ 777607574 776943588 777323761 778907394 778984909 778287659 777931976 776824646 776119995 773889999
1792.8G73889999J553421M628220Q31223j64566J545639O31790j406555j933671J094971
$$ 773889999 775443420 780071640 780902863 780738297 782283936 782915726 781509171 779575500 780670471
1801.5G80670471o11267P01523K552719J181107R37042K24609J30997M23889m28696
$$ 780670471 780059204 780760727 783313446 784494553 785431595 785656204 785787201 786211090 785782394
1810.2G85782394k003555L3035R11332K39639J295547R31778J008301O65207P27921
$$ 785782394 783778839 783811874 784723206 784962845 786258392 787190170 788198471 788863678 789591599
1818.8G89591599M59060j071777k07443o01273R3689m12827l012619J823121L277130
$$ 789591599 790050659 788978882 788771439 788170166 788263855 787851028 784838409 786661530 789938660
1827.5G89938660J459045j845550l091584K700043K250519o48346m43726J28098J68457
$$ 789938660 791397705 789552155 786460571 789160614 791411133 790762787 790319061 790447159 790615616
1836.2G90615616j80206N95703K127838R63592M89121m84162k42233j290588n579071
$$ 790615616 790435410 791031113 793158951 794122543 794611664 794127502 793885269 792594681 787015610
1844.9G87015610J807708K223664M31747Q20465J617661J627655M65393J99280k77710
$$ 787015610 788823318 791046982 791478729 792299194 793916855 795544510 796009903 796209183 795931473
1853.6G95931473j76392p19757j142197m67071p5531R93194J141282J048126L32260
$$ 795931473 795755081 795035324 793893127 793426056 793350525 794343719 795485001 796533127 796865387
1862.2G96865387L72925P3013q34198p72552j542283r79995j873627j6098L238907
$$ 796865387 797238312 797311325 796477127 795704575 794162292 793182297 791308670 791292572 794531479
1870.9G94531479K523575J158294L49198L5858p08313n61295p06253m04892n3558l4866
$$ 794531479 797055054 798213348 798562546 798598404 797890091 797328796 796622543 796217651 796164093 796129227
1880.6G96129227J024322N88227P84606J72959q2474N23148o60706l94287j910019
$$ 796129227 797153549 797741776 798526382 798699341 798616867 799140015 798479309 798085022 796175003
1889.2G96175003k247238J492996J730728J033402P90939m68597l34778J242904J46790
$$ 796175003 793927765 795420761 797151489 798184891 798975830 798507233 798172455 799415359 799562149
1897.9G99562149p17087j107559q02002K09808J34507M34036M15115J090012P93533
$$ 799562149 798845062 797737503 796935501 797145309 797279816 797713852 798128967 799218979 800012512
1906.6H00012512j29318l17078q00705p49588n74340O1111L1281J68457K92739J125794
$$ 800012512 799883194 799566116 798765411 798015823 797441483 797502594 797533875 797702332 797995071 799120865
1916.2G99120865J375427j812744n04608R25903k83203j235962k544022j13754J993103
$$ 799120865 800496292 798683548 798178940 799104843 798821640 797585678 795041656 794927902 796921005
1924.9G96921005J509171Q29544P55386J5717j40076M4479o38580j073074j180725
$$ 796921005 798430176 799259720 800015106 800030823 799890747 799935226 799296646 798223572 797042847
1933.6G97042847J04065L81240K56501N40008N11246O92978K04315Q8806k142029k189788
$$ 797042847 797146912 797528152 797784653 798324661 798835907 799528885 799733200 799822006 797679977 795490189
1943.2G95490189J004486L2730l26767O49032Q35648O18515Q27408J96152m23432j00250
$$ 795490189 796494675 796527405 796200638 796849670 797685318 798303833 799131241 799327393 798903961 798803711
1952.9G98803711m16184n40161o43615j72959j36337P2021R70383O17066L17916J13602
$$ 798803711 798387527 797847366 797203751 797030792 796894455 796966476 797936859 798553925 798871841 798985443
1962.5G98985443L82n91431q67310r62143j282119K14767R03015Q50144O60705L91159
$$ 798985443 798985825 798394394 797527084 796564941 795282822 795497589 796400604 797250748 797911453 798302612
1972.2G98302612L46985J25733m72336r41696k82975m82635p04422P5989N15213L44772
$$ 798302612 798649597 798775330 798302994 797361298 797078323 796595688 795891266 795967255 796482468 796827240
1981.8G96827240P5607N08423L92761k14538q04596j119003j278305o96259N53436
$$ 796827240 796902847 797411270 797804031 797589493 796784897 795665894 794387589 793691330 794244766
1990.5G94244766J14212k24228J095353J315002N18570r6512p00836o98700m36707
$$ 794244766 794358978 794134750 795230103 796545105 797063675 796967163 796266327 795567627 795130920
1999.2G95130920o46591q1177O5995L60412N10865R6511M53568O0425m16870o53458
$$ 795130920 794484329 794403152 794469147 794829559 795340424 795436935 795890503 795950928 795534058 794880600
2008.8G94880600p53250o35147l45841P6523K0142M85763O21720m3412l48968K38876
$$ 794880600 794127350 793492203 793146362 793222885 793243027 793728790 794350510 794307098 793958130 794197006
2018.5G94197006J28632m71726o06537q88977m36019j58539O15844J019440J21002
$$ 794197006 794325638 793853912 793247375 792358398 791922379 791763840 792379684 793399124 793520126
2027.1G93520126M1581J41296k81677j213684o56891k66342m75235L30658J14746L53393
$$ 793520126 793561707 793703003 793421326 792207642 791550751 791284409 790809174 791139832 791254578 791607971
2036.8G91607971N22232J83640J07193k07672o24390q21762l70255m42886J4343L13340
$$ 791607971 792130203 792313843 792421036 792213364 791588974 790767212 790396957 789954071 789968414 790281754
2046.4G90281754K40936M31213K09732L70941j9302k44064l79639p85828r33990n48477
$$ 790281754 790522690 790953903 791163635 791534576 791515274 791271210 790891571 790105743 789171753 788623276
2056.1G88623276J68991J66092L97339K17361K58102K24686l14636n57022j121140
$$ 788623276 788792267 788958359 789355698 789573059 789831161 790055847 789741211 789184189 788063049
2064.7G88063049n63812j08261n1346k6169l5782J69754J25657M44793m98810j123275
$$ 788063049 787499237 787390976 787339630 787313461 787277679 787447433 787573090 788017883 787519073 786395798
2074.4G86395798p35092o83823n22308n85633l25165K2965N06134L79715L9215J41525
$$ 786395798 785660706 784976883 784454575 783868942 783543777 783566742 784072876 784452591 784491806 784633331
2084G84633331k73895m28467n01251n15594l18833k67868j1520O29196N27267L07083
$$ 784633331 784359436 783930969 783429718 782914124 782595291 782327423 782315903 782945099 783472366 783779449
2093.7G83779449N27955k55280l93066O5689M0817j36871k7924L52936L24402N60379
$$ 783779449 784307404 784052124 783659058 783724747 783765564 783628693 783600769 783953705 784278107 784838486
2103.3G84838486L22952J54724K20642L99628L87573n71213m84085k44140J03225M16260
$$ 784838486 785161438 785316162 785536804 785936432 786324005 785752792 785268707 785024567 785127792 785544052
2113G85544052K57492M28086L30505N48172K70309k49557o44608n90286j70593j08032
$$ 785544052 785801544 786229630 786560135 787108307 787378616 787129059 786484451 785894165 785723572 785615540
2122.6G85615540K20260q774l67660m63104M58374P54776k10190P8811j18255o51856
$$ 785615540 785835800 785827026 785459366 784996262 785454636 786209412 785999222 786078033 785959778 785307922
2132.3G85307922n15136J47705L39279K7618M06800L17459L13415J38474k59094l41492
$$ 785307922 784792786 784940491 785279770 785307388 785714188 786031647 786345062 786483536 786224442 785882950
2141.9G85882950j54495K3498j36719L33023L21274L10898P45773N21775J50680k43301
$$ 785882950 785728455 785751953 785615234 785948257 786269531 786580429 787326202 787847977 787998657 787755356
2151.5G87755356m05655l7766J09787k08282q011P2403J53656P5302K47650R09272
$$ 787755356 787349701 787311935 787421722 787213440 787205429 787277832 787431488 787506790 787754440 788663712
2161.2G88663712K39028R4452j30539n91888m78668n90439Q5297J96991L69949M32815
$$ 788663712 788902740 788997192 788866653 788274765 787796097 787205658 787290955 787487946 787857895 788290710
2170.8G88290710p2479j02920j01242J4038n12162r31472m55246J68914J40610M06189
$$ 788290710 788218231 788115311 788014069 788028107 787515945 786584473 786129227 786298141 786438751 786844940
2180.5G86844940M66614r2468K1362j15814J86386L0594n2490K13241k22092R5444
$$ 786844940 787311554 787219086 787240448 787124634 787311020 787341614 787289124 787502365 787280273 787375717
2190.1G87375717L37296Q59756M98734K29110O56434K76031K28500m49600l45611o2638
$$ 787375717 787713013 788572769 789071503 789300613 789957047 790233078 790461578 790011978 789666367 789603729
2199.8G89603729N8670M40216K96860O02493L39127J96838J8082J19247K17209k26593
$$ 789603729 789662399 790102615 790399475 791001968 791341095 791537933 791556015 791675262 791892471 791665878
2209.4G91665878m06799m66156J05133p1182L70636Q09479L61099J0605o6910O57654
$$ 791665878 791259079 790792923 790898056 790826874 791197510 792006989 792368088 792378693 792311783 792969437
2219G92969437k63672p41425o52694m40979L74603K1972M64936M99572J54572R1248
$$ 792969437 792705765 791964340 791311646 790870667 791245270 791267242 791732178 792231750 792386322 792477570
2228.7G92477570k2507m4403k47879j31912m54712j61057o4773J0528M71726O15234
$$ 792477570 792455063 792410660 792162781 792030869 791576157 791415100 791350327 791360855 791832581 792447815
2238.3G92447815L12195k57263J45187m71115n37949j52359m66614j69982j27717L45002
$$ 792447815 792760010 792502747 792647934 792176819 791638870 791486511 791019897 790849915 790722198 791067200
2248G91067200L76205N70679M08401j87683j30462l70102m84162o09970k594J26572
$$ 791067200 791443405 792014084 792422485 792234802 792104340 791734238 791250076 790640106 790637512 790764084
2257.6G90764084N17120O66199J86768O70166m5014j35651k14004m93774k91214m14887
$$ 790764084 791281204 791947403 792134171 792804337 792759323 792623672 792409668 791915894 791624680 791209793
2267.3G91209793J6556P7515P75070N20706q9111Q7051P6752J07650o86340m18472
$$ 791209793 791226349 791303864 792078934 792599640 792510529 792597580 792674332 792781982 792095642 791677170
2276.9G91677170N9051j41143k67106J60904N94483L43323J82495j73035K37808p3013
$$ 791677170 791736221 791595078 791327972 791488876 792083359 792426682 792609177 792436142 792673950 792600937
2286.5G92600937m30908k62375m54025k35596k96250P10831P11746M37775L13263m12903
$$ 792600937 792170029 791907654 791453629 791218033 790921783 791632614 792344360 792782135 793095398 792682495
2296.2G92682495o5918o34003n68771m76532j25503M66919J58615M66995J07727J02463
$$ 792682495 792616577 791982574 791413803 790937271 790811768 791278687 791437302 791904297 792012024 792114487
2305.8G92114487p1259M7379J67465m39530p00531q66928J50147j59989n493K90985
$$ 792114487 792043228 792090607 792258072 791818542 791118011 790251083 790401230 790241241 790235748 790526733
2315.5G90526733n4168M86679j98136l26690k0600J96305p00455j044846q89282j00632
$$ 790526733 790472565 790959244 790761108 790434418 790413818 790610123 789909668 788864822 787975540 787874908
2325.1G87874908J662751j70899L15476Q23288m66462p12585q86536L85285l84827
$$ 787874908 789537659 789366760 789682236 790505524 790039062 789326477 788439941 788825226 788440399
2333.8G88440399K38037K11106l65143J09405K06910J287612K69394J195450P74918
$$ 788440399 788678436 788889542 788524399 788633804 788840714 790128326 790397720 791593170 792368088
2342.5G92368088j586533j547012o06537Q11844J90506M95300J766739J719055P0343
$$ 792368088 790781555 789234543 788628006 789439850 789630356 790125656 791892395 793611450 793681793
2351.2G93681793o85959k43988o5918o77642j991654j108704q2702N65948p00149o2866
$$ 793681793 792995834 792751846 792685928 792008286 790016632 788907928 788825226 789391174 788691025 788628159
2360.8G88628159J737136L05024q8883r97848J173172P69424j349640j44577q9493
$$ 788628159 790365295 790670319 790581436 789583588 790756760 791526184 790176544 790031967 789942474
2369.5G89942474Q02842J256027J278457j6784r6741Q31299m92172n01557K26593K32544
$$ 789942474 790745316 792001343 793279800 793263016 793166275 793997574 793505402 793003845 793230438 793462982
2379.1G93462982j53198N47638J063232L99018O46591N03082J48010j0681m54178n76706
$$ 793462982 793309784 793857422 794920654 795319672 795966263 796469345 796617355 796606674 796152496 795575790
2388.8G95575790n08422l72696N9051P24793Q13064L97339j77307k66113l04642k82517
$$ 795575790 795067368 794694672 794753723 795478516 796291580 796688919 796511612 796245499 795940857 795658340
2398.4G95658340r3460p31048o05164j43127P0114P57980J105042N82809k92358j72806
$$ 795658340 795564880 794833832 794228668 794085541 794155655 794913635 796018677 796601486 796309128 796136322
2408.1G96136322j53732o24314m84390k61001n38559k77482N74189M26025L19824L67356
$$ 796136322 795982590 795358276 794873886 794612885 794074326 793796844 794371033 794797058 795116882 795484238
2417.7G95484238k00806n26352k81219l30048r40247o57806J61896L32412K50626Q67233
$$ 795484238 795283432 794757080 794475861 794145813 793205566 792547760 792709656 793042068 793292694 794159927
2427.3G94159927P85141l48587n99670l37296k86636q11844o73904j97983J09863Q14591
$$ 794159927 794945068 794596481 793996811 793659515 793372879 792561035 791887131 791689148 791799011 792613602
2437G92613602O04858L18985J41907o5918o30188r22165l91388n13840k60009P6675
$$ 792613602 793218460 793537445 793679352 793613434 792983246 792061081 791669693 791155853 790895844 790972519
2446.6G90972519M03061M37164M24347Q62427J34430o21414r69544q21075o01044m66843
$$ 790972519 791375580 791812744 792237091 793099518 793233948 792612534 791642990 790821915 790220871 789754028
2456.3G89754028k28347M6539P80334L32032J95617O65512L25623k79541p03888p34482
$$ 789754028 789525681 789572220 790352554 790684586 790880203 791545715 791871338 791591797 790887909 790153427
2465.9G90153427q97293m85840k88696n5924M85917Q88290Q39844k14691k41318n45273
$$ 790153427 789256134 788770294 788481598 788425674 788911591 789799881 790639725 790425034 790183716 789638443
2475.6G89638443j187210r45435l25851J51977j45416L26462M05273K99836M31671
$$ 789638443 788451233 787505798 787179947 787331924 787186508 787512970 787918243 788218079 788649750
2484.2G88649750l357l18222r64966j022873o91833l21579J79901P21435N85098J31836
$$ 788649750 788646393 788328171 787363205 786340332 785648499 785326920 785506821 786228256 786813354 786945190
2493.9G86945190N15595P9574m55093n19714l59650p49512j291656m55475J11542P41424
$$ 786945190 787460785 787540359 787085266 786565552 786205902 785456390 784164734 783709259 783820801 784562225
2503.5G84562225O90155M38156P16324k89001r30939p55539n74264o01960n43975q5297
$$ 784562225 785252380 785690536 786406860 786117859 785186920 784431381 783857117 783255157 782711182 782625885
2513.2G82625885O63452J181870O86493M6691j84478k56653o37970p12280q05893q88977
$$ 782625885 783289337 784471207 785157700 785204391 785019913 784763260 784125290 783413010 782607117 781718140
2522.8G81718140j77307L29513O60629N79224N41153L15857j89896m21295n93796l93753
$$ 781718140 781540833 781870346 782530975 783110199 783651352 783967209 783777313 783356018 782762222 782368469
2532.5G82368469r20334o86035J29242K15225N31769O79627Q22448J28403p08923p63932
$$ 782368469 781448135 780762100 780891342 781106567 781638336 782317963 783140411 783268814 782559891 781795959
2542.1G81795959n64956n96008p98569j76697N39703O79322K93045O29806P45697j04294
$$ 781795959 781231003 780634995 779836426 779659729 780199432 780878754 781171799 781801605 782547302 782443008
2551.7G82443008n50384j025086r29870o52313l13340j80969J73798R56421N92041
$$ 782443008 781892624 780867538 779937668 779285355 778972015 778791046 778964844 779921265 780513306
2560.4G80513306L91464O9885k38800l87344j041107j231919o90460J80511K18735
$$ 780513306 780904770 780974655 780735855 780348511 779307404 778075485 777385025 777565536 777784271
2569.1G77784271M17404P01142P31048N65491l15933n72815n13916o40869j077957
$$ 777784271 778201675 778902817 779633865 780199356 779883423 779310608 778796692 778155823 777077866
2577.8G77077866o09131K45819K52533N13077N23986P52793J64184r41238p92465n96695
$$ 777077866 776468735 776714554 776967087 777480164 778004150 778756943 778921127 777979889 777187424 776590729
2587.4G76590729n37186l97873l35235k76185L38822O36749M49219M70734L9825n77927
$$ 776590729 776053543 775655670 775320435 775044250 775383072 776019821 776469040 776939774 776979599 776401672
2597.1G76401672r75113n48629l03269o09512k34222L95813M39682L47595M23507j96533
$$ 776401672 775426559 774877930 774574661 773965149 773730927 774126740 774566422 774914017 775337524 775140991
2606.7G75140991m54178n75256p97653n51224o77185m75311K6245N66253P61033M18548
$$ 775140991 774686813 774111557 773313904 772762680 772085495 771610184 771636429 772202682 772963715 773382263
2616.4G73382263k33002m35791l83605j068650o86340q2016j99661m79966j14898P02133
$$ 773382263 773149261 772713470 772329865 771261215 770574875 770492859 770293198 769813232 769698334 770400467
2626G70400467K73056J83411n5542n90058p54471o13937k64358o82984k96783J47934
$$ 770400467 770673523 770856934 770801392 770211334 769456863 768842926 768578568 767895584 767598801 767746735
2635.6G67746735K35977L16314L62397L08609l54996l61099q95233j166993p92312
$$ 767746735 767982712 768299026 768661423 768970032 768615036 768253937 767358704 766191711 765399399
2644.3G65399399m42963J34506J53122L99094K60086L90701K60468l46375p31048j294785
$$ 765399399 764956436 765090942 765244064 765643158 765903244 766293945 766554413 766208038 765476990 764182205
2654G64182205p10678o41632k69394O94962O66046O55975L62854J64871m09927j021423
$$ 764182205 763471527 762829895 762560501 763255463 763921509 764577484 764940338 765105209 764695282 763673859
2663.6G63673859q85697o55212p22275n85861K11181M52271L13873R9182N9662K48566
$$ 763673859 762788162 762132950 761410675 760824814 761035995 761488266 761802139 761901321 761960983 762209549
2673.3G62209549J30386m92935j332397j038666l40271J1597K53067M38766N27573
$$ 762209549 762339935 761847000 760514603 759475937 759135666 759147263 759400330 759839096 760366669
2681.9G60366669M57306m1733r29489q49152o68259o91833n52750k47268L94592L16086
$$ 760366669 760823975 760782242 759852753 759003601 758335342 757643509 757090759 756843491 757238083 757554169
2691.6G57554169K75421K84729J14746n9204n33142q62885o76651j99051m92935l22723
$$ 757554169 757829590 758114319 758229065 758169861 757636719 756773834 756097183 755898132 755405197 755082474
2701.2G55082474K77633L09067O26373M46091k95639n87234n85862o94122o29654p16629
$$ 755082474 755360107 755669174 756295547 756741638 756445999 755858765 755272903 754578781 753949127 753232498
2710.9G53232498m20990J39466J75552L92685Q6746p0419r2850m90570o67343r54514
$$ 753232498 752811508 752950974 753126526 753519211 753605957 753535538 753442688 752952118 752284775 751330261
2720.5G51330261o27823l97644k4032N57174K32697J52588K34909l09677n87158n21470
$$ 751330261 750702438 750304794 750280762 750837936 751070633 751223221 751458130 751148453 750561295 750039825
2730.2G50039825p96127m88129m00924l30506K80610K39563N27420K90832j84784l59878
$$ 750039825 749243698 748755569 748354645 748024139 748304749 748544312 749071732 749362564 749177780 748817902
2739.8G48817902p09305o84662j142807r58557R8800P02744L44543O3248L26080J73951
$$ 748817902 748108597 747423935 746281128 745322571 745421371 746124115 746468658 746531906 746857986 747031937
2749.4G47031937Q4762l86886p53785r44519r13620n29785n24750J40076M89426J67465
$$ 747031937 747116699 746729813 745976028 745031509 744117889 743588104 743063354 743203430 743692856 743860321
2759.1G43860321j9226k20718l59269m36630n60531p86591l24478J40762L1433l01513
$$ 743860321 743841095 743620377 743261108 742824478 742263947 741477356 741152878 741293640 741325073 741023560
2768.7G41023560k19346K52991K13928k06222o98471l45688o38046j430588o92444
$$ 741023560 740804214 741057205 741271133 741064911 740366440 740020752 739382706 737952118 737259674
2777.4G37259674J2589J63574L15475K43073j00250k2278m75312r68093l26157l67966
$$ 737259674 737272263 737435837 737751312 737994385 737894135 737871857 737396545 736428452 736102295 735734329
2787G35734329n21698o51169l80325J80740o8130j64261j14059l1739p63397q25729
$$ 735734329 735212631 734561462 734181137 734361877 734293747 734129486 734015427 733983688 733220291 732394562
2796.7G32394562l00522q31604p39746n51300k55127p4463l52326j16348r2926n64728
$$ 732394562 732094040 731262436 730522690 729971390 729716263 729641800 729289474 729173126 729080200 728515472
2806.3G28515472p85141o49185p00302n35660n60379l46451n035k54974j66931m76685
$$ 728515472 727730331 727081146 726380844 725845184 725284805 724938354 724933319 724678345 724511414 724034729
2816G24034729m93622n25818r37500o87256p08236o29120m01611m64707o96335j37176
$$ 724034729 723541107 723015289 722077789 721390533 720682297 720053177 719651566 719186859 718490524 718353348
2825.6G18353348L42941n16891q05436q43505r08051q80966j073914q73031n61600
$$ 718353348 718696289 718179398 717373962 716530457 715622406 714741440 713667526 712794495 712232895
2834.3G12232895j04218k37426n93262p71256j302261j256790j435013j947021j847001
$$ 712232895 712128677 711891251 711297989 710526733 709224472 707967682 706532669 704585648 702738647
2843G02738647j713638j331024j495438j869735j358261j614991k002105j361390o46743
$$ 702738647 701025009 699693985 698198547 696328812 694970551 693355560 691353455 689992065 689345322
2851.7F89345322q45490j234817n44281k83585k35977J72653O16760N42374p70493
$$ 689345322 688499832 687265015 686720734 686437149 686201172 686373825 686990585 687532959 686762466
2860.3F86762466p99865m15497q47015p02668m92477n36041j192398j150437l24173
$$ 686762466 685962601 685547104 684700089 683997421 683504944 682968903 681776505 680626068 680301895
2869F80301895k41394n22766o34537n25970j081467j544113r44977m16870m31137m68445
$$ 680301895 680060501 679537735 678903198 678377228 677295761 675751648 674806671 674389801 673958664 673490219
2878.7F73490219k75955j56555L8757J08261n31845q19549n95627j061325j117630
$$ 673490219 673214264 673057709 673096466 673204727 672672882 671853333 671257706 670196381 669078751
2887.3F69078751q66471q67538m25263m68979m51736n90363r30480o94886q62426q72498
$$ 669078751 668212280 667344742 666919479 666450500 665998764 665408401 664477921 663783035 662920609 662048111
2897F62048111p69348p14035p93381q70819o05164l49121J14212k56347l52936m23355
$$ 662048111 661278763 660564728 659771347 658900528 658295364 657946243 658060455 657804108 657451172 657027817
2906.6F57027817j083679m12903m26483j042786r39865q74100q74863j067123q83942
$$ 657027817 655944138 655531235 655104752 654061966 653122101 652248001 651373138 650306015 649422073
2915.3F49422073q74481j075516j147232j331939j082230j091995q69827N7907r0180
$$ 649422073 648547592 647472076 646324844 644992905 643910675 642818680 641948853 642006760 641916580
2924F41916580o03409j6327N40543M10233J26571j53274l32489k88849l44086J0834
$$ 641916580 641313171 641296844 641837387 642247620 642374191 642220917 641888428 641599579 641255493 641266327
2933.6F41266327R36508J134415N96161K94876N74569M73328K84882O15616L25851
$$ 641266327 642202835 643337250 643933411 644228287 644802856 645276184 645561066 646176682 646502533
2942.3F46502533J08032J19858K86484M93393J89438K44445K93579N2796p93305q58764
$$ 646502533 646610565 646730423 647016907 647510300 647699738 647944183 648237762 648290558 647497253 646638489
2952F46638489O866o65283q48541Q3160J74103K5940M69513O39343m6768l93143M6616
$$ 646638489 646645355 645980072 645131531 645214691 645388794 645414734 645884247 646523590 646476822 646083679 646130295
2962.6F46130295N10177K46430j07575N17044J493531J118011N67780J204452R98612
$$ 646130295 646640472 646886902 646779327 647296371 648789902 649907913 650475693 651680145 652678757
2971.2F52678757O16531Q48007Q25882L96729K60696J200714J416245R97085R52607
$$ 652678757 653295288 654143295 654969177 655365906 655626602 656827316 658243561 659240646 660193253
2979.9F60193253J067428Q37784M97665Q56018N35813K98462Q98895R92889N03312
$$ 660193253 661260681 662098465 662596130 663452148 663987961 664286423 665185318 666178207 666681519
2988.6F66681519M82177P22351O41098R39942N09491K01416L78952R5749J61056K9068
$$ 666681519 667163696 667886047 668527145 669467087 669976578 670177994 670556946 670652695 670813751 670842819
2998.2F70842819L04947L38135j20010j05820k31171k27432N4855K35443o8817k8076
$$ 670842819 671147766 671485901 671365891 671260071 671028900 670801468 670856323 671091766 671022949 670994873
3007.9F70994873K34680p6370l13797m4251P1259k25296k61307n70831j67007J14135
$$ 670994873 671229553 671153183 670839386 670795135 670866394 670641098 670379791 669808960 669641953 669756088
3017.5F69756088n29327n21851q45337n33828n1346l26996p7133k58332o41250k96860
$$ 669756088 669226761 668704910 667859573 667325745 667274399 666947403 666870270 666611938 665970688 665673828
3027.2F65673828N8594l73154p35168o79016p57676l42559K85415j82113p13120l09296
$$ 665673828 665732422 665359268 664624100 663945084 663187408 662844849 663130264 662948151 662235031 661925735
3036.8F61925735m56085l35159j95999o81458r36203q47473k76642o08291o54831l88947
$$ 661925735 661469650 661134491 660938492 660257034 659320831 658473358 658196716 657588425 656933594 656544647
3046.5F56544647l88489j05667n05447l30200p46460j166001n26657n10711l84446
$$ 656544647 656156158 656050491 655545044 655214844 654468384 653302383 652775726 652265015 651880569
3055.1F51880569k16369l21808m28543k15149l92075o03180o00814p25327p44934j381378
$$ 651880569 651664200 651342392 650913849 650698700 650306625 649703445 649102631 648377304 647632370 646250992
3064.8F46250992p77970o5383J40914J64338n35660J3733j58997q72345q61587o90689
$$ 646250992 645473022 645407639 645548553 645712891 645177231 645190964 645031967 644159622 643298035 642607346
3074.4F42607346m09928n77240m40826m15268M5700J98135K8000l6545r85336j097336
$$ 642607346 642197418 641620178 641179352 640764084 640809784 641007919 641035919 640999374 640014038 638916702
3084.1F38916702o87751k07291n39894j298981o69670k23847n34591l61748L43437
$$ 638916702 638228951 638021660 637481766 636182785 635513115 635289268 634754677 634392929 634736366
3092.7F34736366m8256o72683j049958j094207o6452R3498k88429j000329j048126
$$ 634736366 634688110 634015427 632965469 631871262 631804810 631898308 631609879 630609550 629561424
3101.4F29561424K6627k00920p64466n35926k99073m67186r38797r46998l12233o59294
$$ 629561424 629588051 629387131 628622665 628086739 627787666 627320480 626381683 625434685 625122452 624463158
3111.1F24463158j066170l76663j02158j42250j098137j163444j23864p81593j130943
$$ 624463158 623396988 623020325 622918167 622775917 621677780 620514336 620390472 619608879 618477936
3119.8F18477936n59387n29671r52110n48172l7270o85425o99119m73442n94635o68221
$$ 618477936 617918549 617388878 616436768 615888596 615851326 615165901 614466782 613993340 613398705 612730484
3129.4F12730484j364288j479836p14950o01120q50487q14591k99072J78070l15361
$$ 612730484 611366196 609886360 609171410 608570290 607719803 606905212 606606140 606784210 606468849
3138.1F06468849o76460j056976j368943r04541r55391j415481j259728n66902l69072
$$ 606468849 605792389 604735413 603366470 602461929 601506538 600091057 598831329 598264427 597895355
3146.8E97895355j56746L1624n81970j165772j342277r06868r85184j285324q19168
$$ 597895355 597738609 597770233 597188263 596022491 594680214 593773346 592788162 591502838 590683670
3155.4E90683670l38860m36744n99442l95927r66683q98094o88820j114044r55658
$$ 590683670 590344810 589908066 589308624 588912697 587946014 587047920 586359100 585245056 584289398
3164.1E84289398j152839j112862j093598o66503m82216q32596l69530p46651r75608
$$ 584289398 583136559 582023697 580930099 580263596 579781380 578948784 578579254 577832603 576856995
3172.8E76856995r40705j101532j156921j236191r33685p72515j66358m07410o46210
$$ 576856995 575916290 574814758 573657837 572421646 571487961 570715446 570549088 570141678 569495468
3181.5E69495468k56004q60596j098213j247902j240463p79381o80313p99332q73070
$$ 569495468 569239464 568378868 567280655 566032753 564792290 564012909 563332596 562533264 561660194
3190.1E61660194p45735o60896n95169n52368o96564j278877j404343j071205j051445
$$ 561660194 560914459 560253563 559658394 559106026 558409462 557130585 555726242 554655037 553603592
3198.8E53603592p89108m01993l04527n16739r17130j327934n87006l27797j269798
$$ 553603592 552814484 552412491 552107964 551591225 550674095 549346161 548759155 548431358 547161560
3207.5E47161560j075020p49473m57917r05723j197205k35939l50952o84166q23669
$$ 547161560 546086540 545337067 544879150 543973427 542776222 542540283 542189331 541505165 540681496
3216.2E40681496p43370o60706j063538j293678j192932m51889n19409q38700m70695
$$ 540681496 539938126 539277420 538213882 536920204 535727272 535275383 534755974 533917274 533446579
3224.9E33446579J7128L25584m89006j313667j432075j397896r02558l05519n71708
$$ 533446579 533463707 533789291 533300285 531986618 530554543 529156647 528254089 527948570 527376862
3233.5E27376862q51250n85098m83666o96754r02405m18320n63545j059227j095276
$$ 527376862 526525612 525940514 525456848 524760094 523857689 523439369 522875824 521816597 520721321
3242.2E20721321q33740j79749m66156o29043o29883o88019m85229o63643n80254p73697
$$ 520721321 519887581 519707832 519241676 518612633 517982750 517294731 516809502 516145859 515565605 514791908
3251.9E14791908j013145j079178o56395l88870p59087n57365l29781k01530n59731
$$ 514791908 513778763 512699585 512043190 511654320 510895233 510337868 510008087 509806557 509246826
3260.5E09246826o58569o13442q76808p92198r40742o04477n46036j78757L94364l82119
$$ 509246826 508588257 507974815 507098007 506305809 505365067 504760590 504214554 504035797 504430161 504048042
3270.2E04048042p43293m93737q45070j518631q62693k46125p12623o96984l16696
$$ 504048042 503304749 502811012 501965942 500447311 499584618 499338493 498625870 497928886 497612190
3278.9D97612190m0207j42631m82941j061020p04880j76773o09397n51301m12864o39420
$$ 497612190 497571983 497429352 496946411 495885391 495180511 495003738 494394341 493843040 493430176 492790756
3288.5D92790756r63821m9668M39187n46608n11055k33117m55818j209945j202507
$$ 492790756 491826935 491777267 492216454 491669846 491158791 490925674 490469856 489259911 488057404
3297.2D88057404o15197m34265l34587q01811k36588J26076p2365K32468n60989j231804
$$ 488057404 487442207 487007942 486673355 485871544 485634956 485761032 485688667 485921135 485360146 484128342
3306.8D84128342r79767j274109j239548k97889m35067k33116J43700q16918p38601
$$ 484128342 483148575 481874466 480634918 480337029 479901962 479668846 479812546 478995628 478257027
3315.5D78257027j52130j41144q78639j337243j032562p59125k59208l97606o21224
$$ 478257027 478104897 477963753 477085114 475747871 474715309 473956184 473696976 473299370 472678146
3324.2D72678146p60688o84243l63922n40504j190949j519813o03524o78062p94983
$$ 472678146 471917458 471233215 470869293 470328789 469137840 467618027 467014503 466336441 465541458
3332.9D65541458n03692q61321l99780m65699k67028k46125j159095j110535p67517
$$ 465541458 465037766 464176445 463776665 463310966 463043938 462797813 461638718 460528183 459760666
3341.6D59760666p68662j077575p93572o34269j121483p67060j08032J22109n77279
$$ 459760666 458992004 457914429 457120857 456486588 455365105 454598045 454490013 454612122 454034843
3350.2D54034843j359329j027641r36279j101303q79899r85031q12301m98848l01438
$$ 454034843 452675514 451647873 450711594 449610291 448730392 447745361 446933060 446434212 446132774
3358.9D46132774k65655r57794j146736j076394r73091p82013q93783p58820l99208
$$ 446132774 445867119 444909325 443762589 442686195 441713104 440931091 440037308 439278488 438879280
3367.6D38879280Q5259p85637j376152o97823q35342o47011o33965q97178n70031p46688
$$ 438879280 438964539 438178902 436802750 436104927 435269585 434622574 433988609 433091431 432521400 431774712
3377.2D31774712q40493l25012j51214n83039q77762p67021n52749p25823j001129
$$ 431774712 430934219 430609207 430457993 429874954 428997192 428230171 427677422 426951599 425950470
3385.9D25950470q02574Q240J25122n54772j63116k1668n21507j198616j034126O294
$$ 425950470 425147896 425156136 425281258 424726486 424563370 424541702 424020195 422821579 421787453 421793747
3395.6D21793747l88527r18350o16989K96058K99111p22657m34379j50070j22261m79889
$$ 421793747 421405220 420486870 419869881 420165939 420465050 419742393 419308014 419157944 419035683 418555794
3405.2D18555794o53916k72903j82571l55263q64678j53389J70060m19503j94282l8491
$$ 418555794 417901878 417628975 417446404 417091141 416226463 416073074 416243134 415823631 415629349 415590858
3414.8D15590858k81791m30908j19820k34299k86102j17188k73284j72310J60713N45120
$$ 415590858 415309067 414878159 414758339 414524040 414237938 414120750 413847466 413675156 413835869 414380989
3424.5D14380989j8692o27823J3924M38232l44314n36194m24423j38970J023216O63376
$$ 414380989 414362297 413734474 413748398 414186630 413842316 413306122 412881699 412742729 413765945 414429321
3434.1D14429321M28505N45883p515K05346K68402K13318j58654m11262l81508M45671
$$ 414429321 414857826 415403709 415396194 415601540 415869942 416083260 415924606 415513344 415131836 415577507
3443.8D15577507P29294M82788J035309k76222K36358J220284L10249M17290J83716
$$ 415577507 416306801 416789589 417824898 417548676 417785034 419005318 419315567 419732857 419916573
3452.5D19916573K01225K83584N60418P65953N11398N81551L29132Q80584P39556M5509
$$ 419916573 420117798 420401382 420961800 421727753 422239151 422820702 423149834 424030418 424769974 424815483
3462.1D24815483K8343L68843Q41408R12895P47452M28658J030960R04770N71975N31311
$$ 424815483 424843826 425212669 426054077 426966972 427714424 428143082 429174042 430078812 430650787 431182098
3471.7D31182098J98365Q43582M03709J20850N77621P59392Q82073M87823Q83217R79118
$$ 431182098 431380463 432224045 432627754 432748604 433326225 434085617 434967690 435455513 436338730 437317848
3481.4D37317848L72811N24826J233825R61762L85322O02799J12304P0382J090088
$$ 437317848 437690659 438215485 439449310 440411072 440796394 441399193 441511497 441581879 442671967
3490.1D42671967J642036J567879J251793K13546O8245P61185L24211P98035J035881
$$ 442671967 444314003 445881882 447133675 447347221 447415466 448176651 448500862 449298897 450334778
3498.7D50334778Q01582M78821L38554J539536Q92258L7345Q62160R04923M94270J013489
$$ 450334778 451136360 451615181 451953735 453493271 454385529 454422874 455285034 456189957 456684227 457697716
3508.4D57697716R16481j6022J366005K043838J299592R83505P52220O48880Q73222
$$ 457697716 458614197 458598175 459964180 462008018 463307610 464291115 465043335 465692215 466565437
3517.1D66565437P51610K35901P59048J024895J371422R53026P8125J312408J252365
$$ 466565437 467317047 467552948 468311996 469336891 470708313 471661339 471739464 473051872 474304237
3525.7D74304237M90418N21355J452980J180191N61523J099205J284752J625709Q07763
$$ 474304237 474794655 475316010 476768990 477949181 478510704 479609909 480894661 482520370 483328133
3534.4D83328133J251983J258774K79389J658401J373940R38339O44493N53818P30629
$$ 483328133 484580116 485838890 486118279 487776680 489150620 490088959 490733452 491287270 492017899
3543.1D92017899M39033O39038J493645K342453R54704J679268J699944J129875J056709
$$ 492017899 492456932 493095970 494589615 496932068 497886772 499566040 501265984 502395859 503452568
3551.8E03452568n06363J290283J236458J952210J897316O91337K056732J027871J197433
$$ 503452568 502946205 504236488 505472946 507425156 509322472 510013809 512070541 513098412 514295845
3560.5E14295845Q98476J546440J284408K79580K825431m45442O28357J344338K66532
$$ 514295845 515194321 516740761 518025169 518304749 521130180 520684738 521313095 522657433 522923965
3569.1E22923965L762246K225227J536102J354142J629371J142235P96280K099800
$$ 522923965 526686211 528911438 530447540 531801682 533431053 534573288 535369568 537469368
3576.9E37469368J186218K489624J911392J033402J717072J676521J540794R21135
$$ 537469368 538655586 541145210 543056602 544090004 545807076 547483597 549024391 549945526
3584.6E49945526L482628L40271j578140K862091L21922L558922L757934K517891R12209
$$ 549945526 553428154 553768425 552190285 555052376 555374298 558933220 562691154 565209045 566121254
3593.2E66121254M69208K664871r31320K740402M088669Q02574K323837P43294J399155
$$ 566121254 566590462 569255333 568324013 571064415 575153084 575955658 578279495 579022789 580421944
3601.9E80421944L019027K729378K597580K013207K47421j658440L737259N02663J028518
$$ 580421944 583440971 586170349 588767929 590781136 591028557 589370117 593107376 593610039 594638557
3610.6E94638557P516823J310425o07834L739014l10478L610725L180504p23801J415673
$$ 594638557 602155380 603465805 602857971 606596985 606286507 609897232 613077736 612353935 613769608
3619.3F13769608l80059J673813M453201L898125L096924K649422J347084J947670
$$ 613769608 613389549 615063362 619516563 623414688 626511612 629161034 630508118 632455788
3627F32455788N417595k174035q733177N616036O486206N870628J695328l31421L718491
$$ 632455788 637873383 635699348 626966171 632582207 639068413 644939041 646634369 646302948 650021439
3635.7F50021439L628387J350708K16522K515641L308105K335815K93122L7308K734985
$$ 650021439 653649826 655000534 655217056 657732697 661040802 663376617 663669739 663707047 666442032
3644.4F66442032L950577N029297k039948k935104M925079j388321k491074K036210
$$ 666442032 670392609 675421906 673381958 670446854 675371933 673983612 671492538 673528748
3652.1F73528748O639251M059525L142700M065552o277085L392106N755920J667099
$$ 673528748 680167999 684227524 687370224 691435776 685158691 688550797 694306717 695973816
3659.8F95973816K159500P16171J485672p6980N30319K062225J266480M086609L27072
$$ 695973816 698133316 698849487 700335159 700258179 700788498 702850723 704117203 708203812 708530884
3668.5G08530884l142014N54199m442520L580628P335968M607010o830979j3774337
$$ 708530884 705388870 705943069 701500549 705081177 712417145 717024155 710193176 696418839
3676.2F96418839P132034R583130N653305j106262P99789K572403J321106J900940
$$ 696418839 703550873 713134003 718787308 717681046 718480835 721053238 722374344 724275284
3683.9G24275284J92642n87616K997818L534164j0183715k196350P811508m036942
$$ 724275284 724467926 723880310 726878128 730412292 720228577 718032227 725843735 721806793
3691.6G21806793J177597N687027M32205K10267j354599o00892J631012R37348K364578
$$ 721806793 722984390 728671417 729103622 729313889 727959290 727358398 728989410 729926758 732291336
3700.3G32291336J864548l887177r56192M608231J471176l17383L29819K314529K686005
$$ 732291336 734155884 730268707 729312515 733920746 735391922 735074539 735404358 737718887 740404892
3709G40404892p584000L488999K447281j0743866P313842N234681R1781K53525J004257
$$ 740404892 732820892 736309891 738757172 728013306 735327148 740561829 740653610 740907135 741911392
3717.7G41911392j39618l107071J374283M506989l836746k577668O150818L92075k248917
$$ 741911392 741771774 738664703 740038986 744545975 740709229 738131561 744282379 744674454 742425537
3726.3G42425537j712189J114655L097382k79694M273605l799667p701187P742691
$$ 742425537 740713348 741828003 744925385 744645691 748919296 745119629 737418442 745161133
3734G45161133k1210p790985Q68301K707138J021576L077088K449112l846512L330994
$$ 745161133 745139923 737348938 738217239 740924377 741945953 745023041 747472153 743625641 746956635
3742.7G46956635R490356j4331207j3327408J1684952O598281N212632n854721j0926743
$$ 746956635 756446991 742115784 728788376 740473328 747071609 752284241 746429520 735502777
3750.4G35502777J0985336m732513m493485P410126M632263K327271m947815K264252
$$ 735502777 746488113 741755600 737262115 744672241 749304504 751631775 746683960 748948212
3758.2G48948212L062057p473755J660157M668579O57730O0425L030319l272705m184952
$$ 748948212 752010269 744536514 746196671 750865250 751522980 751583405 754613724 751341019 747156067
3766.8G47156067L482513L976975j123581q325272L159485M034882O03561J072312
$$ 747156067 750638580 754615555 753491974 745166702 748326187 752361069 752964630 754036942
3774.5G54036942n80903L36228K2430K115479p19300o952590K828903K207641J127091
$$ 754036942 753456039 753792267 753814697 755930176 755210876 748258286 751087189 753294830 754421921
3783.2G54421921J793594l708267j413269J419601J169434Q98056j68839J66779M58
$$ 754421921 756215515 752507248 751093979 752513580 753683014 754581070 754412231 754579010 754579468
3791.9G54579468K2583l19443J256485K198410n601349l976517L072129L727188L936386
$$ 754579468 754602051 754282608 755539093 757737503 752136154 748159637 751231766 754958954 758895340
3800.6G58895340q326263q590851N931854L736572L912125L374252r795074k344132
$$ 758895340 750569077 741978226 747910080 751646652 755558777 758933029 749137955 746793823
3808.3G46793823M986573K291488P51190L68042J76239Q55561L536300n160293j1814881
$$ 746793823 751780396 754071884 754823074 755191116 755367355 756222916 759759216 754598923 742784042
3817G42784042P390519N950164K999802k594986j7028809M712525O947479L228378
$$ 742784042 750174561 756124725 759124527 756529541 739500732 744213257 751160736 754389114
3824.7G54389114K216111o38886l529587Q06656K828064K443161j673660q271256M250641
$$ 754389114 756605225 755966339 752436752 753243408 756071472 758514633 756840973 748569717 752820358
3833.4G52820358O217118p099762j23749P175369r823913m129487P256394l495178
$$ 752820358 759037476 751937714 751813965 758989334 749165421 745035934 752292328 748797150
3841.1G48797150J343460N513611l990326k205353M304886J804504K3880J495285k021637
$$ 748797150 750140610 755654221 751663895 749458542 753763428 755567932 755591812 757087097 755065460
3849.8G55065460J304016L332138r454498L224487j2268219K183152J0278015j348801
$$ 755065460 756369476 759701614 750247116 753471603 741203384 743386536 753664551 752315750
3857.5G52315750N9128L102264J544190N70373o371078N78155N026017n827332k464828
$$ 752315750 752374878 755477142 757021332 757591705 751220627 751798782 756824799 750997467 748532639
3866.2G48532639M415054L934936L749390q915939o928635N421295N646210R65576
$$ 748532639 752947693 756882629 760632019 751716080 744787445 750208740 755854950 756820526
3873.9G56820526r570083K698822N191574M84695K079239J707535p721939l813019
$$ 756820526 747250443 749949265 755140839 755625534 757704773 759412308 751690369 747877350
3881.6G47877350O759262J311493J252975K277146j2637558L239593M450684N11551
$$ 747877350 754636612 755948105 757201080 759478226 746840668 750080261 754530945 755042496
3889.3G55042496L873596k041016q366546K079544M288330k68555J124573J47705R71298
$$ 755042496 758916092 756875076 748508530 750588074 754876404 754607849 755732422 755880127 756851425
3898G56851425M24195r005967M907608N65873m626008N701600l368683j131516J913986
$$ 756851425 757275620 748269653 753177261 753743134 749117126 754818726 751450043 750318527 752232513
3906.7G52232513J511918J941604l48205N19332l31192j72348n8746m99725Q77838
$$ 752232513 753744431 755686035 755337830 755857162 755525970 755353622 755294876 754795151 755672989
3915.3G55672989P04346l496018k422790M239044J24588k554321K231521P91397P5760
$$ 755672989 756377335 752881317 750458527 754697571 754822159 752267838 754499359 755290756 755366516
3924G55366516k396698j762237K524185J860580K20719j767273N41229J239776l670272
$$ 755366516 752969818 751207581 753731766 755592346 755813065 754045792 754587021 755826797 752156525
3932.7G52156525o64063K047196N90591Q60214K97547l38898n6381m52729J236344
$$ 752156525 751492462 753539658 754130249 754990463 755288010 754949112 754892731 754440002 755676346
3941.4G55676346K56805m039459J15585J708222Q95767P01828k141876L60260l7689
$$ 755676346 755933151 751893692 752009277 753717499 754613266 755315094 753173218 753533478 753495789
3950.1G53495789j735993J561127M66766Q5373N26581l11127K10190M39529q0566n89600
$$ 753495789 751759796 753320923 753787689 753873062 754399643 754088516 754298706 754738235 754657669 754068069
3959.7G54068069P88346q7586j024322Q91876j8005m93927K51846l23181j89972L62625
$$ 754068069 754856415 754768829 753744507 754636383 754618378 754124451 754376297 754053116 753863144 754225769
3969.3G54225769K14233J72196l63464m45939K91291J0986m00619m54026M06266M22821
$$ 754225769 754440002 754612198 754248734 753802795 754094086 754105072 753704453 753250427 753656693 754079514
3979G54079514l12653M25949N73731j50223k79694K45972k44599r4680P90176M2419
$$ 754079514 753766861 754192810 754766541 754616318 754336624 754582596 754337997 754243317 755033493 755075912
3988.6G55075912j73950q9416j51825j95313Q8883j24893p16248K47726N46799K97852
$$ 755075912 754901962 754812546 754660721 754465408 754554291 754429398 753713150 753960876 754507675 754805527
3998.3G54805527k50016k09884
$$ 754805527 754555511 754345627
4000.2G54345627
$$ 754345627
##END=$$ End of the data block
