##TITLE=$$ Begin of the data block
##JCAMP-DX=5.00 $$ ACD/SpecManager v 10.08
##SPECTROMETER/DATA SYSTEM=Varian
##DATE=07 Jan 2013 10:46:22
##DATA TYPE=INFRARED SPECTRUM
##DATA CLASS=XYDATA
##ORIGIN=
##OWNER=
##NPOINTS=3735
##FIRSTX=399.26403809
##LASTX=4000.35498047
##MAXX=4000.35498047
##MINX=399.26403809
##MAXY=83.72037506
##MINY=17.39963913
##XFACTOR=1.0000000000
##YFACTOR=0.000000100000000
##FIRSTY=55.14170456
##DELTAX=0.96440572
##XUNITS=1/CM
##YUNITS=TRANSMITTANCE
##XYDATA=(X++(Y..Y))
$$ plain form
399.3 551417046 693228683 724715195 751144485 837203751 622822151 507823524 507196960
406 507196960 512410469 684854355 825581055 735036011 518229408 341229973 286444416
412.8 286444416 298241711 367679749 359348030 330724869 371123772 475746231 580036087
419.5 580036087 552628059 533301048 549126244 477087669 465591621 563557167 564860115 591962967
427.2 591962967 706232834 614923439 454397011 425103798 551602516 626383286 584153824
434 584153824 521390572 462341728 494727859 561717682 578359146 566932259 534013977 582882729
441.7 582882729 601945114 588761444 598916893 574640846 552599602 506431656 574897423
448.4 574897423 604179802 522047958 527252274 533441963 522312813 547052956 554926414 569469223
$$ packed form
399.3E51417046J41811637L1486512K6429290Q6059266k14381600j14998627o26564
406E07196960N213509J72443886J40726700r0545044k16806603j76999435n4785557
412.8B86444416J1797295O9438038q331719k8623161M0398903J04622459J04289856
419.5E80036087k7408028j9327011J5825196p2038575j1496048R7965546J302948K7102852
427.2E91962967J14269867r1309395j60526428k9293213J26498718P4780770m2229462
434E84153824o2763252n9048844L2386131O6989823J6641464j1426887l2918282M8868752
441.7E82882729J9062385j3183670J0155449k4276047k2041244m6167946O8465767
448.4E74897423K9282379q2131844N204316O189689j1129150K4740143P873458J4542809
$$ plain form
456.2 569469223 668158188 662804565 509977455 469030151 427563515 452495384 547763786
462.9 547763786 558649940 530103149 460142403 394381943 373203888 452607346 548741226
469.7 548741226 538523102 603139420 605101166 561234436 594033546 584866600 567435417 544431496
477.4 544431496 545288429 532478943 496245575 466946945 470664864 478978386 462604561 500295563
485.1 500295563 525498161 561284752 574302025 561679382 631657829 614119072 508626747
491.8 508626747 524237137 587510185 609664001 632402115 621898499 530680618 516838837
498.6 516838837 562623634 539323616 515229530 513316154 531697350 549687500 564700699 586140785
506.3 586140785 567535744 527681427 521118279 531121330 533605843 535744171 541256599 567386208
$$ packed form
456.2E69469223R8688965n353623j52827110m0947304m1466636K4931869R5268402
462.9E47763786J0886154k8546791o9960746o5760460k1178055P9403458R6133880
469.7E48741226j0218124O4616318J961746m3866730L2799110r166946j7431183k3003921
477.4E44431496Q56933j2809486l6233368k9298630L717919Q313522j6373825L7691002
485.1E00295563K5202598L5786591J3017273j2622643O9978447j7538757j05492325
491.8E08626747J5610390O3273048K2153816K2738114j0503616r1217881j3841781
498.6E16838837M5784797k3300018k4094086j913376J8381196J7990150J5013199K1440086
506.3E86140785j8605041l9854317o563148J0003051K484513K138328N512428K6129609
$$ plain form
514 567386208 565406609 508594170 498113785 539315224 574197578 605500565 596795044 552887650
521.7 552887650 511062660 504651260 496261749 492420769 543172760 550544853 521753502 512994881
529.5 512994881 512238388 493580322 471902847 490756683 524614449 559184456 570833893 532335777
537.2 532335777 516021919 523415337 517848663 506283569 525058975 557258682 528343430 497162895
544.9 497162895 497833252 494780540 524182396 557627258 553559875 525251198 497226295 508095284
552.6 508095284 518435478 500574303 516025734 544187508 548341370 539904442 523743668 513691978
560.3 513691978 505811310 516937637 541450882 545479050 549317856 545635681 538756790 537608566
568 537608566 511605301 488741035 509855576 551695404 559982567 541650200 541887894 550646019
$$ packed form
514E67386208j979599n6812439j0480385M1201439L4882354L1302987q705521m3907394
521.7E52887650m1824990o411400q389511l840980N0751991P372093k8791351q758621
529.5E12994881p56493j8658066k1677475J8853836L3857766L4570007J1649437l8498116
537.2E32335777j6313858P393418n566674j1565094J8775406L2199707k8915252l1180535
544.9D97162895O70357l052712K9401856L3444862m067383k8308677k8024903J0868989
552.6E08095284J0340194j7861175J5451431K8161774M153862q436928j6160774j0051690
560.3E13691978p880668J1126327K4513245M028168L838806l682175o878891j148224
568E37608566k6003265k2864266K1114541M1839828Q287163j8332367K37694Q758125
$$ plain form
575.8 550646019 532313957 504862785 497083588 512918015 523871918 508502159 505905266 520545235
583.5 520545235 524127884 509974823 501700134 530233727 552627525 551118088 541253777 520113564
591.2 520113564 521815872 536287041 540088806 541530457 538327637 521206436 506919441 516916656
598.9 516916656 523773041 528281860 526246986 507836418 506408081 511494637 501685905 494061394
606.6 494061394 490958786 469020691 450698242 465474052 472450333 448858795 427832489 431772385
614.3 431772385 435115967 436628647 436792259 427997284 422356415 406553040 400622787 400705872 395777969
623 395777969 398632431 390406723 392445564 404430542 416528397 448569221 479479408 481186790
630.7 481186790 465011559 458272781 462442245 454454689 445281868 451281967 445321350 435788803
$$ packed form
575.8E50646019j8332062k7451172p779197J5834427J0953903j5369759k596893J4639969
583.5E20545235L582649j4153061q274689K8533593K2393798j509437r864311k1140213
591.2E20113564J702308J4471169L801765J441651l202820j7121201j4286995R997215
598.9E16916656O856385M508819k034874j8410568j428337N086556r808732p624511
606.6D94061394l102608k1938095j8322449J4775810O976281k3591538k1026306L939896
614.3D31772385L343582J512680J63612q794975n640869j5803375n930253Q3085m927903
623C95777969K854462q225708K038841J1984978J2097855L2040824L0910187J707382
630.7D81186790j6175231o738778M169464p987556r172821O000099n960617r532547
$$ plain form
638.4 435788803 442414742 446815758 453859825 461069107 475247345 499491425 502389793 495259018
646.2 495259018 501095657 506400414 523544235 553925056 546344337 528259277 541090317 559003563
653.9 559003563 558852158 538339310 537787857 560427780 580034103 583318214 571243019 571407585
661.6 571407585 567078667 559324493 565295410 576158905 597360992 623356514 573166389 532068558
669.3 532068558 548271866 564639816 562241669 561940269 559205704 551609154 550306282 557799568
677 557799568 568686409 580496674 587605209 586302185 596737976 603291550 590018616 574542007
684.7 574542007 575453186 583674240 578593102 568502312 560424805 566743202 576336861 566829262
692.4 566829262 556937637 564581413 568441734 557552795 571876984 591579819 581725845 570038376
$$ packed form
638.4D35788803O625939M401016P044067P209282J4178238K4244080K898368p130775
646.2D95259018N836639N304757J7143821L0380821p580719j8085060J2831040J7913246
653.9E59003563j51405k0512848n51453K2639923J9606323L284111j2075195J64566
661.6E71407585m328918p754174N970917J0863495K1202087K5995522n0190125m1097831
669.3E32068558J6203308J6367950k398147l01400k734565p596550j302872P493286
677E57799568J0886841J1810265P108535j303024J0435791O553574j3272934j5476609
684.7E74542007R11179Q221054n081138j0090790q077507O318397R593659r507599
692.4E66829262r891625P643776L860321j0888939J4324189J9702835r853974j1687469
$$ plain form
700.2 570038376 571392784 569975471 551943665 544076920 542688866 539873619 550407257 554448471
707.9 554448471 557426720 565154152 563498993 560003891 569796677 580039520 580556450 578205376
715.6 578205376 567229576 572376747 592152977 596143761 591020126 588995361 585218582 578405838
723.3 578405838 591774368 602045631 590902481 582490082 579844818 589144745 594705925 587115479
731 587115479 577890968 579160385 589300423 587050629 582662964 577656593 572624741 581304283 588693810
739.7 588693810 585141983 582155838 584458389 590303154 592018700 578437119 573436546 576248016
747.4 576248016 569802017 582281113 600579948 599609184 603986130 616883354 619246750 616467705
755.1 616467705 620430603 629338226 627798462 616400299 616454506 619710388 622348404 624410973 621304855
$$ packed form
700.2E70038376J354408j417313j8031806p866745j388054k815247J0533638M041214
707.9E54448471K978249P727432j655159l495102R792786J0242843N16930k351074
715.6E78205376j0975800N147171J9776230L990784n123635k024765l776779o812744
723.3E78405838J3368530J0271263j1143150q412399k645264R299927N561180p590446
731E87115479r224511J269417J0140038k249794m387665n006371n031852Q679542P389527
739.7E88693810l551827k986145K302551N844765J715546j3581581n000573K811470
747.4E76248016o445999J2479096J8298835r70764M376946J2897224K363396k779045
755.1F16467705L962898Q907623j539764j1398163N4207L255882K638016K062569l106118
$$ plain form
763.8 621304855 623931808 626957550 628102722 626824799 629111710 635409889 637945976 633278618
771.5 633278618 619618492 617196236 617972527 625163116 644601440 646321030 637742424 629835281
779.2 629835281 628547897 633641968 640411606 651149979 657123718 658487625 648725204 634084663
787 634084663 639628487 661648865 669607773 663574371 660704193 663093338 667671967 661013184 656876678
795.6 656876678 660358047 664634018 669694443 664436951 655861664 646272278 645868149 656734619
803.4 656734619 661881943 657467270 653080292 660226593 661690140 660816650 660597382 657671661 668069077
812 668069077 671216736 665094223 660901794 650461426 647054825 652391739 653875656 657688675 658824234
820.7 658824234 652789307 660490112 670657120 661973877 650639114 648379517 651349182 655494843
$$ packed form
763.8F21304855K626953L025742J145172j277923K286911O298179K536087m667358
771.5F33278618j3660126k422256P76291P190589J9438324J719590q578606p907143
779.2F29835281j287384N094071O769638J0738373N973739J363907r762421j4640541
787F34084663N543824K2020378P958908o033402k870178K389145M578629o658783m136506
795.6F56876678L481369M275971N060425n257492q575287r589386m04129J0866470
803.4F56734619N147324m414673m386978P146301J463547q73490k19268k925721J0397416
812F68069077L147659o122513m192429j0440368l406601N336914J483917L813019J135559
820.7F58824234o034927P700805J0167008q683243j1334763k259597K969665M145661
$$ plain form
828.4 655494843 657853470 661134033 661129837 644176102 635169487 642798767 640500641 630256729 621723328
837.1 621723328 622150688 618953857 608010521 604793587 602773743 599758911 589477081 576659622
844.8 576659622 572692757 575305557 588525963 599336548 599040871 594445648 597346306 605251732
852.5 605251732 600694847 594923515 600622940 609226875 617094841 629253387 636750870 628892021
860.3 628892021 620805359 629366760 642850723 641780930 638973923 642640839 639525108 637788086
868 637788086 641971359 640407486 634557953 632342148 638031998 645843506 646061859 643898392 650317078
876.7 650317078 659850616 657541504 649761963 646925888 641099777 633391533 632121048 636256638
884.4 636256638 634223900 622110291 616357574 619514618 618922195 614413071 611076660 613875427
$$ packed form
828.4F55494843K358627L280563m196j6953735r006615P629280k298126j0243912q533401
837.1F21723328M27360l196831j0943336l216934k019844l014832j0281830j2817459
844.8E76659622l966865K612800J3220406J0810585k95677m595223K900658P905426
852.5F05251732m556885n771332N699425Q603935P867966J2158546P497483p858849
860.3F28892021q086662Q561401J3483963j069793k807007L666916l115731j737022
868F37788086M183273j563873n849533k215805N689850P811508K18353k163467O418686
876.7F50317078R533538k309112p779541k836075n826111p708244j270485M135590
884.4F36256638k032738j2113609n752717L157044n92423m509124l336411K798767
$$ plain form
892.1 613875427 620024185 618548508 618025589 625824966 629297867 632626190 632810249 625969658 632005234
900.8 632005234 637005730 628987770 629283829 633036842 629005356 627944832 630733604 625923691 618116798
909.4 618116798 617031708 617947617 611878166 601506615 597962303 592928963 582176056 580766029
917.2 580766029 583245392 579836197 575636368 577839355 578041649 574278908 576438446 572060165 563778229
925.8 563778229 560824547 557380257 555069695 554466553 555689621 553413506 551930161 548629951 540991936
934.5 540991936 545993958 550750542 553291855 567497864 576965294 578341980 584336319 593954430
942.2 593954430 595409355 592015457 594761124 603323555 611456070 612674599 610142136 607317047
949.9 607317047 611449585 620462837 625088387 627663612 623368568 616693344 616530228 615760803 612259140
$$ packed form
892.1F13875427O148758j475677n22919P799377L472901L328323J84059o840591O035576
900.8F32005234N000496q017960K96059L753013m031486j060524K788772m809913p806893
909.4F18116798j085090R15909o069451j0371551l544312n033340j0752907j410027
917.2E80766029K479363l409195m199829K202987K02294l762741K159538m378281q281936
925.8E63778229k953682l444290k310562o03142J223068k276115j483345l300210p638015
934.5E40991936N002022M756584K541313J4206009R467430J376686N994339R618111
942.2E93954430J454925l393898K745667Q562431Q132515J218529k532463k825089
949.9F07317047M132538R013252M625550K575225m295044o675224j63116p69425l501663
$$ plain form
958.6 612259140 610776978 611547279 615110283 612423515 596375351 586231232 587636948 588891220
966.3 588891220 589677162 591225700 593041687 594411621 592201805 583256264 576018677 575376320 576608124
975 576608124 574124107 568448486 570750046 576114464 578995285 577451553 571886063 571517258 567137680
983.7 567137680 561498718 560329781 557588463 559167252 562331505 558612099 550879211 546737404
991.4 546737404 543526611 539007416 529274330 514016304 504529305 500684700 508774452 522867546
999.1 522867546 526673088 526078377 524003487 524625511 525332298 521728859 517200661 515273285 515897026
1007.8 515897026 510942078 510971069 517660637 517290421 514493980 514394226 511481438 505482750 505865440
1016.5 505865440 505606003 501689987 503811798 504955254 498568382 489545746 482957382 478254395
$$ packed form
958.6F12259140j482162P70301L563004k686768j6048164j0144119J405716J254272
966.3E88891220P85942J548538J815987J369934k209816q945541p237587o42357J231804
975E76608124k484017n675621K301560N364418K880821j543732n565490l68805m379578
983.7E67137680n638962j168937k741318J578789L164253l719406p732888m141807
991.4E46737404l210793m519195r733086j5258026r486999l844605Q089752J4093094
999.1E22867546L805542n94711k074890O22024P06787l603439m528198j927376O23741
1007.8E15897026m954948K8991O689568l70216k796441r9754k912788n998688L82690
1016.5E05865440k59437l916016K121811J143456o386872r022636o588364m702987
$$ plain form
1024.2 478254395 478157654 480143471 477972145 473136902 467714462 466476936 467646675 468553810 463307076
1032.9 463307076 458044777 459989204 453921356 449557953 454987411 458736877 457030182 453337593
1040.6 453337593 453961983 450001335 444253845 447436905 450237274 447643204 448106461 449259758 449519997
1049.3 449519997 454737129 454152107 452979088 456718636 453963203 453855553 458166046 459311752 460481491
1058 460481491 458861809 454852371 452345886 445665359 438207321 438457108 441150436 440598602 440487328
1066.6 440487328 443237724 445813408 450126572 450270233 448558197 449859581 447212944 446092415
1074.4 446092415 441652069 437571678 439483528 439964371 440467644 437380714 437820702 439507561 438327827
1083 438327827 438105850 435455322 434416847 433570480 434673424 434014168 429106407 423434219 419181595
$$ packed form
1024.2D78254395r6741J985817k171326m835243n422440j237526J169739R07135n246734
1032.9D63307076n262299J944427o067848m363403N429458L749466j706695l692589
1040.6D53337593O24390l960648n747490L183060K800369k594070M63257J153297K60239
1049.3D49519997N217132n85022j173019L739548k755433j07650M310493J145706J169739
1058D60481491j619682m009438k506485o680527p458038K49787K693328n51834j11274
1066.6D40487328K750396K575684M313164J43661j712036J301384k646637j120529
1074.4D46092415m440346m080391J911850M80843N03273l086930M39988J686859j179734
1083D38327827k21977k650528j038475q46367J102944o59256m907761n672188m252624
$$ plain form
1091.7 419181595 416145859 402268372 393117409 394693756 388116608 378557892 373619919 367040024
1099.4 367040024 357664032 349189682 332691154 315063267 304687729 296654053 290474796 281579399
1107.1 281579399 272415485 263162346 256192837 250073528 241196156 230916653 222322483 221175385
1114.9 221175385 219349117 214297981 215327930 223771191 224008026 222114525 226761055 225730038
1122.6 225730038 221754017 217661076 220081596 223593826 224438763 227676411 226360874 226022472 228885021
1131.2 228885021 231348133 227434483 219717693 212198105 208330498 210386600 207512589 204822788
1139 204822788 198539200 191481667 188836269 185677738 186695614 185816517 185319023 182250519 176822777
1147.6 176822777 174625187 174866657 179286118 180073643 175371933 173996391 179565849 178660259 177632980
$$ packed form
1091.7D19181595l035736j3877487r150963J576347o577148r558716m937973o579895
1099.4C67040024r375992q474350j6498528j7627887j0375538q033676o179257q895397
1107.1B81579399r163914r253139o969509o119309q877372j0279503q594170j147098
1114.9B21175385j826268n051136J029949Q443261K36835j893501M646530j031017
1122.6B25730038l976021m092941K420520L512230Q44937L237648j315537l38402K862549
1131.2B28885021K463112l913650p716790p519588l867607K056102k874011k689801
1139B04822788o283588p057533k645398l158531J017876q79097m97494l068504n427742
1147.6A76822777k197590K41470M419461P87525m701710j375542N569458r05590j027279
$$ plain form
1156.3 177632980 182202682 183537197 184906044 185400219 192916851 201799946 205840302 208542786
1164 208542786 211040630 215491982 217082996 221504230 230916138 242858887 248907967 252728901
1171.8 252728901 258617611 261349754 269575405 277985058 287088203 295159035 302535076 311755791
1179.5 311755791 312645607 320028000 335729942 346874237 352462463 358702545 368753853 373343430
1187.2 373343430 376473045 385282440 393538094 395708351 395134544 397318230 402661324 408206978
1194.9 408206978 412914276 418089218 422554283 428797798 434423676 436473274 439755402 446374741
1202.6 446374741 454174194 457738419 457308006 459571152 464945679 466806297 468943977 474998207
1210.3 474998207 477428551 477676697 478952370 480421944 480583725 482903633 487850647 485835838 483779984
$$ packed form
1156.3A77632980M569702J334515J368847M94175P516632Q883095M040356K702484
1164B08542786K497844M451352J591014M421234R411908J1942749O049080L820934
1171.8B52728901N888710K732143Q225651Q409653R103145Q070832P376041R220715
1179.5C11755791Q89816P382393J5701942J1144295N588226O240082J0051308M589577
1187.2C73343430L129615Q809395Q255654K170257n73807K183686N343094N545654
1194.9D08206978M707298N174942M465065O243515N625878K049598L282128O619339
1202.6D46374741P799453L564225m30413K263146N374527J860618K137680O054230
1210.3D74998207K430344K48146J275673J469574J61781K319908M947014k014809k055854
$$ plain form
1219 483779984 484728012 483556633 484313889 484895248 485754013 486003189 485528412 486701736 485412178
1227.7 485412178 485882568 490106735 490473404 488170357 488200226 486740494 482649345 481996269 486573524
1236.4 486573524 491763077 492441330 490151329 491098061 496055069 497529564 496671982 499278412 499013596
1245 499013596 496225929 496928062 499965897 500572166 494927826 491172180 492834740 494531250 497788277
1253.7 497788277 500870819 499736366 498790131 501504936 503866272 505342484 505915642 504242516 503515816
1262.4 503515816 503418236 506202469 507593231 505645256 506807327 505689011 507203712 512411537 513442001
1271.1 513442001 514248466 514891396 515933609 517428017 519456558 520417709 522448769 527824173 529712296
1279.8 529712296 531255798 532466240 533413315 535109138 536182899 538930740 540964279 544958725
$$ packed form
1219D83779984R48028j171379P57256N81359Q58765K49176m74777J173324j289558
1227.7D85412178M70390M224167L66669k303047K9869j459732m091149o53076M577255
1236.4D86573524N189553O78253k290001R46732M957008J474495q57582K606430k64816
1245D99013596k787667P02133L037835O06269n644340l755646J662560J696510L257027
1253.7D97788277L082542j134453r46235K714805K361336J476212N73158j673126p26700
1262.4E03515816r7580K784233J390762j947975J162071j118316J514701N207825J030464
1271.1E13442001Q06465O42930J042213J494408K028541R61151K031060N375404J888123
1279.8E29712296J543502J210442R47075J695823J073761K747841K033539L994446
$$ plain form
1287.5 544958725 548336830 551966362 557477493 558482552 557704582 558252335 561572609 563655548 564187164
1296.2 564187164 567033310 570064201 572090073 571945305 571284180 571113434 572387199 574744301 577564049
1304.8 577564049 580311050 580497627 581289597 583005562 584623299 585292702 585225182 586022606 584754944
1313.5 584754944 583923264 586201210 589004517 590529594 592587280 595672836 595395737 593310623 592856789
1322.2 592856789 591641693 590287361 592780113 596020393 599500389 601208038 597938957 599401817
1329.9 599401817 603086205 601278572 598999176 600050621 604449005 605615234 605209579 607699280
1337.6 607699280 606305885 602309532 600037766 599724045 598948555 597960243 598928566 598928070 600689011
1346.3 600689011 602560310 601286049 601636353 602329674 601337090 599992599 598710632 597386284 597462502
$$ packed form
1287.5E44958725L378105L629532N511131J005059p77970N47753L320274K082939N31616
1296.2E64187164K846146L030891K025872j44768o61125j70746J273765K357102K819748
1304.8E77564049K747001J86577P91970J715965J617737O69403o7520P97424j267662
1313.5E84754944q31680K277946K803307J525077K057686L085556k77099k085114m53834
1322.2E92856789j215096j354332K492752L240280L479996J707649l269081J462860
1329.9E99401817L684388j807633k279396J051445M398384J166229m05655K489701
1337.6F07699280j393395l996353k271766l13721p75490r88312R68323m96J760941
1346.3F00689011J871299j274261L50304O93321r92584j344491j281967j324348P6218
$$ plain form
1355 597462502 596935158 595913582 598210526 600083733 601391716 600774536 597792397 597622604 595002327
1363.7 595002327 593345642 593034325 593541794 594762115 591954765 591541176 594066505 592995377 590998917
1372.3 590998917 590339279 588863258 586197777 584237442 584181137 583801155 581109238 582020721 585330849
1381 585330849 584693909 583184700 583619461 583819923 583423157 584513626 584864960 585969772 590272560
1389.7 590272560 591701813 588392143 585794525 588537407 590990868 586698761 585301247 584104080
1397.4 584104080 586000824 588542366 583838234 582240486 583447418 583991508 582605705 579348068
1405.1 579348068 576668015 575924416 576997414 576552086 575912285 577749977 580067062 580674400 579126549
1413.8 579126549 576982155 575219612 576529274 580008125 578777885 573096313 576006050 578327103
$$ packed form
1355E97462502n27344j021576K296944J873207J307983o17180k982139j69793k620277
1363.7E95002327j656685l11317N07469J220321k807350m13589K525329j071128j996460
1372.3E90998917o59638j476021k665481j960335n6305l79982k691917R11483L310128
1381E85330849o36940j509209M34761K00462l96766J090469L51334J104812M302788
1389.7E90272560J429253l309670k597618K742882K453461m292107j397514j197167
1397.4E84104080J896744K541542m704132j597748J206932N44090j385803l257637
1405.1E79348068k680053p43599J072998m45328o39801J837692K317085O07338j547851
1413.8E79126549k144394j762543J309662L478851j230240n681572K909737K321053
$$ plain form
1421.5 578327103 576914940 577826347 581848221 582384033 582234421 580367584 579345360 581865959 580456390
1430.2 580456390 579117584 583581772 587403717 589776001 591332359 591510582 589106140 589025726 591468811
1438.9 591468811 590333176 590309792 593382034 591968231 590037994 592197418 597522659 600069160 596112099
1447.6 596112099 591062164 592150497 594109764 594264908 597936783 600308266 599903221 600857925 595363312
1456.2 595363312 596442528 607399025 604273758 602465973 603594131 605727882 609158173 611039391
1464 611039391 608744583 611037445 615767288 617629166 618699188 619656830 618493309 616520386 621489067
1472.6 621489067 625176582 626606293 628953438 630344124 634640236 637035522 638100204 639780045
1480.3 639780045 639773026 641423416 641482162 640764999 642171783 643594742 644458084 644598465 645381851 637796097
$$ packed form
1421.5E78327103j412163R11407M021874N35812j49612j866837j022224K520599j409569
1430.2E80456390j338806M464188L821945K372284J556358J78223k404442q0414K443085
1438.9E91468811j135635k3384L072242j413803j930237K159424N325241K546501l957061
1447.6E96112099n049935J088333J959267J55144L671875K371483m05045R54704n494613
1456.2E95363312J079216J0956497l125267j807785J128158K133751L430291J881218
1464F11039391k294808K292862M729843J861878J070022R57642j163521j972923M968681
1472.6F21489067L687515J429711K347145J390686M296112K395286J064682J679841
1480.3F39780045p019J650390N8746p17163J406784J422959Q63342J40381P83386p585754
$$ plain form
1490 637796097 633519592 637309608 638912735 640215683 639596443 640977936 642186890 641328278 637003860
1498.7 637003860 633366928 636174889 634327049 631864433 630463982 629507980 625867195 607968063
1506.4 607968063 612389755 619474716 618317833 614080887 614133377 612772827 609411049 607851868 604997711
1515.1 604997711 604584732 598573189 597333488 603908653 609149170 610278358 609952316 608041534 599957924
1523.7 599957924 596804237 595168228 593823814 595139198 598867531 599570312 596423035 597142677 599836006
1532.4 599836006 596493301 588259850 588461494 592198181 594100037 592857590 582808952 581622467
1540.1 581622467 591982498 589861679 578393631 581528358 589037170 585315628 582243576 582372093
1547.9 582372093 585689354 587709312 585863457 587631569 591080055 595320663 590661392 587586937
$$ packed form
1490F37796097m276505L790016J603127J302948o19240J381493J208954q58612m324418
1498.7F37003860l636932K807961j847840k462616j400451r56002l640785j7899132
1506.4F07968063M421692P084961j156883m236946N2490j360550l361778j559181k854157
1515.1F04997711m12979o011543j239701O575165N240517J129188l26042j910782q083610
1523.7E99957924l153687j636009j344414J315384L728333P02781l147277P19642K693329
1532.4E99836006l342705q233451K01644L736687J901856j242447j0048638j186485
1540.1E81622467J0360031k120819j1468048L134727P508812l721542l072052J28517
1547.9E82372093L317261K019958j845855J768112L448486M240608m659271l074455
$$ plain form
1555.6 587586937 591691818 598412743 618382607 611467209 597489891 600149422 601627121 601451759
1563.3 601451759 601977501 603632355 604125595 602666855 602679710 606051903 601780586 603743401 605998116
1572 605998116 604710999 604924545 603740234 603943596 599832077 601794434 602541618 598596573 598294601
1580.6 598294601 597013512 597468414 597329140 594616318 593210640 590811958 588053818 583788071 582202187
1589.3 582202187 581677589 579144554 577155685 576315193 574998169 573925438 571493797 565475197 562191391
1598 562191391 559834900 558126373 555357361 552717438 551928749 547227516 543165703 540522156 539054146
1606.7 539054146 534520607 531116447 531038857 528834648 526916809 524602203 524440079 521209869 519553490
1615.4 519553490 519550438 510540543 511552124 509208069 506427040 503064842 500770454 498363190 492679100
$$ packed form
1555.6E87586937M104881O720925J9969864o915398j3977318K659531J477699j75362
1563.3F01451759N25742J654854M93240j458740J2855L372193m271317J962815K254715
1572F05998116j287117K13546j184311K03362m111519J962357P47184l945045l01972
1580.6E98294601j281089M54902j39274k712822j405678k398682k758140m265747j585884
1589.3E82202187n24598k533035j988869q40492j317024j072731k431641o018600l283806
1598E62191391k356491j708527k769012k639923p88689m701233m061813k643547j468010
1606.7E39054146m533539l404160p7590k204209j917839k314606j62124l230210j656379
1615.4E19553490l052r009895J011581k344055k781029l362198k294388k407264n684090
$$ plain form
1624 492679100 493614845 495107155 496180115 491011620 489821358 489462738 485786781 484689903 483974304
1632.7 483974304 484909248 484127541 483342781 477899895 476156769 479128647 478272171 475879364 473966980
1641.4 473966980 475249596 474283905 474234314 475166092 476412430 480478363 475075493 474989891 476477966
1650.1 476477966 479418068 482254295 480669327 485002441 484105988 484490051 484781151 488885231 490916595
1658.8 490916595 492380028 494909325 496684761 500891228 499752159 500905647 503028030 504370079
1666.5 504370079 504316902 503757591 509847145 514685249 517026253 517074013 521247902 526684189 529141693
1675.1 529141693 526955910 528866539 533757286 536757317 541153412 542108536 543240814 548234367
1682.9 548234367 549572144 554978943 556954536 559984131 562047577 563691788 568538170 571979370
$$ packed form
1624D92679100R35745J492310J072960n168495j190262l58620l675957j096878p15599
1632.7D83974304R34944p81707p84760n442886j743126K971878q56476k392807j912384
1641.4D73966980J282616r65691m9591R31778J246338M065933n402870q5602J488075
1650.1D76477966K940102K836227j584968M333114q96453L84063K91100M104080K031364
1658.8D90916595J463433K529297J775436M206467j139069J153488K122383J342049
1666.5E04370079n3177n59311O089554M838104K341004M7760M173889N436287K457504
1675.1E29141693k185783J910629M890747L000031M396095R55124J132278M993553
1682.9E48234367J337777N406799J975593L029595K063446J644211M846382L441200
$$ plain form
1690.6 571979370 574688911 577997513 582108650 585770798 589092255 590885925 596005096 602347412
1698.3 602347412 607993965 611780891 611328545 617756958 621671867 623715363 629366684 639133034
1706 639133034 641714020 639940720 644628220 649130707 650485840 651955185 655585480 660911407 660296860
1714.7 660296860 660440674 663406219 660388565 656283112 661737442 667014542 669271164 671833725
1722.4 671833725 674259262 675082932 676667404 678645554 681044922 681058350 681898270 681547089 680217972
1731.1 680217972 684715576 690507889 695598450 682846832 683815689 691356964 692537231 693205261
1738.8 693205261 694131622 691411819 692576828 693524246 695826263 699152832 701055222 702702789 705719986
1747.5 705719986 707091827 707233963 710948486 713554230 714715805 717415161 720409470 724050140
$$ packed form
1690.6E71979370K709541L308602M111137L662148L321457J793670N119171O342316
1698.3F02347412N646553L786926m52346O428413L914909K043496N651321R766350
1706F39133034K580986j773300M687500M502487J355133J469345L630295N325927o14547
1714.7F60296860J43814K965545l017654m105453N454330N277100K256622K562561
1722.4F71833725K425537Q23670J584472J978150K399368J3428Q39920l51181j329117
1731.1F80217972M497604N792313N090561j2751618R68857P541275J180267O68030
1738.8F93205261R26361k719803J165009R47418K302017L326569J902390J647567L017197
1747.5G05719986J371841J42136L714523K605744J161575K699356K994309L640670
$$ plain form
1755.2 724050140 729070053 729509659 727125854 729469604 730718613 730320435 729407959 733639221 739184952
1763.9 739184952 738514481 736949615 740324097 743537445 739990387 739740982 741388092 739960632 738809204
1772.5 738809204 735118103 738004990 743153000 744332962 744867477 746644440 749124451 748925095 746322708
1781.2 746322708 745565414 746874466 749512177 750863113 750730515 751090012 751469803 751551743 750969162
1789.9 750969162 747374954 746402130 747423782 747348709 750042419 751235428 751561813 753874207 756478043
1798.6 756478043 754185867 751791458 754443741 752211304 752403793 757753448 760692291 758194656
1806.3 758194656 754557724 756434479 760367584 761764374 758832321 757266541 756959305 755573196
1814 755573196 756365204 758216095 760539856 761832809 761539841 760980911 761525726 762780685 761422882
$$ packed form
1755.2G24050140N019913M39606k383805K343750J249009l98178r12476M231262N545731
1763.9G39184952o70471j564866L374482L213348l547058k49405J647110j427460j151428
1772.5G38809204l691101K886887N148010J179962N34515J776963K480011j99356k602387
1781.2G46322708p57294J309052K637711J350936j32598L59497L79791Q1940n82581
1789.9G50969162l594208r72824J021652p5073K693710J193009L26385K312394K603836
1798.6G56478043k292176k394409K652283k232437J92489N349655K938843k497635
1806.3G58194656l636932J876755L933105J396790k932053j565780l07236j386109
1814G55573196P92008J850891K323761J292953k92968n58930N44815J254959j357803
$$ plain form
1822.7 761422882 760393982 761536026 760587463 759517593 763170547 766837997 766254883 761791992 760975571
1831.4 760975571 764812546 765558014 764154587 764377594 764157333 764171448 764730988 765658798 764710846
1840.1 764710846 765813904 767482147 765987091 763774033 760210037 761873932 763910751 765295029
1847.8 765295029 767228851 768440018 769740143 770044556 768634109 768182144 770306244 770077820 769011688
1856.4 769011688 769430237 768234558 767259521 767038574 767642517 768388062 770798264 772821808 771162949
1865.1 771162949 769409790 768024139 768463287 768337555 766229706 766212540 766539993 768490448 772213440
1873.8 772213440 774000626 772786942 770479431 768579254 770041962 771815033 771006851 771720428 773674850
1882.5 773674850 773124084 770300827 771229782 771816559 770183334 771398392 771835403 772958221 773839188
$$ packed form
1822.7G61422882j028900J142044r48563j069870L652954L667450n83114m462891q16421
1831.4G60975571L836975P45468j403427K23007k20261J4115N59540R27810r47952
1840.1G64710846J103058J668243j495056k213058l563996J663895K036819J384278
1847.8G65295029J933822J211167J300125L04413j410447m51965K124100k28424j066132
1856.4G69011688M18549j195679r75037k20947O03943P45545K410202K023544j658859
1865.1G71162949j753159j385651M39148j25732k107849j7166L27453J950455L722992
1873.8G72213440J787186j213684k307511j900177J462708J773071q08182P13577J954422
1882.5G73674850n50766k823257R28955N86777j633225J215058M37011J122818Q80967
$$ plain form
1891.2 773839188 771981201 769759750 769974747 771801376 771782608 772697678 773722458 773113708 770212479
1899.8 770212479 768657761 770573273 770571899 770966415 771534882 771817627 772081070 771712189 773321075
1908.5 773321075 772779846 771441879 771931152 771321335 770346146 770860138 771449356 770950165 771788712
1917.2 771788712 772319412 771417770 769826508 768770218 771406326 772453537 770267181 769055099 768478394
1925.9 768478394 769636688 770486832 770035706 770405045 770903168 770217361 769651566 770205917 769023132
1934.6 769023132 769258575 772154312 770227051 768244400 769298553 769376221 770389404 769830093 769029999
1943.2 769029999 771229782 772156525 770644073 769366074 769335403 769841156 771339951 771735840 769882584
1951.9 769882584 767108917 767709885 771131058 770850677 769898224 769741745 769684601 771253586 771186981
$$ packed form
1891.2G73839188j857987k221451K14997J826629j8768R15070J024780o08750k901229
1899.8G70212479j554718J915512j374L94516N68467K82745K63443l68881J608886
1908.5G73321075n41229j337967M89273o09817r75189N13992N89218m99191Q38547
1917.2G71788712N30700r01642j591262j056290K636108J047211k186356j212082n76705
1925.9G68478394J158294Q50144m51126L69339M98123o85807n65795N54351j182785
1934.6G69023132K35443K895737j927261j982651J054153P7668J013183n59311q00094
1943.2G69029999K199783R26743j512452j277999l0671N05753J498795L95889j853256
1951.9G69882584k773667O00968L421173k80381r52453j56479n7144J568985o6605
$$ plain form
1960.6 771186981 768888550 767552185 768178940 768655090 768684235 769081650 768645477 767306366 767287750
1969.3 767287750 768054657 768286438 768589325 768149948 768975601 769723282 768576660 768090515 767166977
1978 767166977 767319870 767833176 767900620 769528809 769303207 767036972 766545334 767052917 766872482 766590195
1987.6 766590195 766178207 766908417 767232819 767458954 767990570 765707703 764635620 763331070 762961655
1996.3 762961655 765324554 764349518 763455811 765868225 767598495 767133026 767167053 765466080 762163010
2005 762163010 762666016 763039169 763501205 766071014 766899338 765195465 764056931 764356995 764256973
2013.6 764256973 765109634 764581299 763716202 762546997 759728470 761589050 764143600 763382950 762014313
2022.3 762014313 762138748 764709854 765961990 764500504 761656494 759182739 758099365 759133301
$$ packed form
1960.6G71186981k298431j336365O26755M76150K9145L97415m36173j339111j8616
1969.3G67287750P66907K31781L02887m39377Q25653P47681j146622m86145r23538
1978G67166977J52893N13306O7444J628189k25602k266235m91638N07583j80435k82287
1987.6G66590195m11988P30210L24402K26135N31616k282867j072083j304550l69415
1996.3G62961655K362899r75036q93707K412414J730270m65469L4027j700973l303070
2005G62163010N03006L73153M62036K569809Q28324j703873j138534L00064j00022
2013.6G64256973Q52661n28335q65097j169205k818527J860580K554550p60650j368637
2022.3G62014313J24435K571106J252136j461486k844010k473755j083374J033936
$$ plain form
2030 759133301 760715408 760739288 761383743 761319504 760552673 761547089 761314316 759601898 758647842 758191833
2039.7 758191833 759208984 760143204 759373474 759617615 760548935 761084137 762321091 762257156 759813385
2048.4 759813385 759054260 758964386 757595444 758000259 759398651 760156097 758267059 756936874 758331680
2057 758331680 757793121 757020035 755839920 755111618 756571655 757975769 758359070 757468719 759181442
2065.7 759181442 759052048 755663605 755681000 756175766 756041946 755665817 753998489 754159317 755276947
2074.4 755276947 754055099 753532867 754462357 752764893 750772629 750224075 750604172 752921219 753778152
2083.1 753778152 751588821 750888519 752710800 752916489 751693344 751521149 751274338 749875793 748764648
2091.7 748764648 748873749 749896851 750186844 748027115 747063217 748729401 750000610 750688629 750764618
$$ packed form
2030G59133301J582107K3880O44455o4239p66831R94416k32773j712418r54056m56009
2039.7G58191833J017151R34220p69730K44141R31320N35202J236954o3935k443771
2048.4G59813385p59125q9874j368942M04815J398392P57446j889038j330185J394806
2057G58331680n38559p73086j180115p28302J460037J404114L83301q90351J712723
2065.7G59181442j29394l388443J7395M94766j33820l76129j667328J60828J117630
2074.4G55276947j221848n22232R29490j697464j992264n48554L80097K317047Q56933
2083.1G53778152k189331p00302J822281K05689j223145j72195k46811j398545j111145
2091.7G48764648J09101J023102K89993k159729r63898J666184J271209O88019P5989
$$ plain form
2100.4 750764618 751176834 751348419 750303268 750676956 751687927 752618713 753971405 753081741 752221756
2109.1 752221756 754177628 755284119 754013290 752227020 751459732 751608810 751955414 752292633 752944717
2117.8 752944717 754536209 755604019 755875092 755009155 751941299 749957962 750813065 752004089 752716064
2126.5 752716064 753743057 754328995 753178406 750560608 749173508 750432434 752412567 752698288 751206665
2135.1 751206665 750806885 751478882 751523514 750781174 750079346 751532211 754354401 754882812 753413620
2143.8 753413620 753842087 754282150 753875580 753130188 751828232 753516769 754207230 754642487 756326752
2152.5 756326752 754345474 753566360 754878769 755418396 754780426 752971268 752804413 753901138 753731995
2161.2 753731995 753695908 755576172 755494080 754258118 754114151 754856873 756540604 756324158 756271362 755883408
$$ packed form
2100.4G50764618M12216J71585j045151L73688J010971R30786J352692q89664q59985
2109.1G52221756J955872J106491j270829j786270p67288J49078L46604L37219O52084
2117.8G52944717J591492J067810K71073q65937l067856j983337Q55103J191024P11975
2126.5G52716064J026993N85938j150589k617798j387100J258926J980133K85721j491623
2135.1G51206665l99780O71997M4632p42340p01828J452865K822190N28411j469192
2143.8G53413620M28467M40063m06570p45392j301956J688537O90461M35257J684265
2152.5G56326752j981278p79114J312409N39627o37970j809158j66855J096725j69143
2161.2G53731995l6087J880264q2092j235962j43967P42722J683731k16446n2796l87954
$$ plain form
2170.8 755883408 753307037 751875534 753248215 754823303 754266739 754451599 755085831 754905319 754534988
2179.5 754534988 754627762 754109116 751925201 750932922 751671600 754639816 756738358 756050720 754719696
2188.2 754719696 754248581 755643311 754915390 754284897 755651474 757138748 758159256 757042694 756206741
2196.9 756206741 756036072 756069336 756755142 759883957 761098328 758021240 757911606 758011475 758088455 758386993
2206.5 758386993 757123337 758250885 759340973 759335403 759372711 760094833 759745331 758206787 759064484
2215.2 759064484 759967804 760425186 760414658 758433380 756989059 758638992 761251678 761504745 760702515
2223.9 760702515 760152588 760817032 762017212 761125336 759391479 758069687 757236328 757098083 757006989
2232.5 757006989 758228378 758698578 757073441 756821976 756951752 757960358 758981628 758261032 758021240
$$ packed form
2170.8G55883408k576371j431503J372681J575088n56564J84860O34232j80512l70331
2179.5G54534988R2774n18646k183915r92279P38678K968216K098542o87638j331024
2188.2G54719696m71115J394730p27921o30493J366577J487274J020508j116562q35953
2196.9G56206741j70669L3264O85806L128815J214371l077088j09634R9869P6980K98538
2206.5G58386993j263656J127548J090088n570L7308P22122l49502j538544Q57697
2215.2G59064484R03320M57382j0528j981278j444321J649933K612686K53067q02230
2223.9G60702515n49927O64444J200180q91876j733857j321792q33359j38245r1094
2232.5G57006989J221389M70200j625137k51465J29776J008606J021270p20596k39792
$$ plain form
2241.2 758021240 757958145 759255753 759651947 758621292 758702087 758899002 759534454 760013123 760590744 759856033
2250.9 759856033 759750748 760902176 759776154 759760361 759793472 758955154 759584351 760241547 760033264 759436111
2260.5 759436111 759405670 759891129 760948715 760123291 758547363 760221863 761083603 759004593 759479599
2269.2 759479599 761977921 762004089 760836105 757918930 755796890 757483444 758460236 758100967 758870239
2277.9 758870239 760535660 760603256 759219894 758279877 758693924 759478378 759902878 761459579 760702133
2286.5 760702133 757822571 756222382 757107162 759798203 759940186 759201355 761259003 763176346 761167450
2295.2 761167450 759883728 759487991 758085709 759353104 758389130 757593994 759137344 760435104 761733475
2303.9 761733475 759758759 758989716 759395676 759610977 760602188 759876862 759361115 758704758 758715744 758947525
$$ packed form
2241.2G58021240o3095J297608L96194j030655Q0795J96915O35452M78669N77621p34711
2250.9G59856033j05285J151428j126022j5793L3111q38318O29197O57196k08283n97153
2260.5G59436111l0441M85459J057586q25424j575928J674500Q61740k079010M75006
2269.2G59479599K498322K6168j167984k917175k122040J686554R76792l59269P69272
2277.9G58870239J665421O7596j383362r40017M14047P84454M24500J556701p57446
2286.5G60702133k879562j600189Q84780K691041J41983p38831K057648J917343k008896
2295.2G61167450j283722l95737j402282J267395r63974p95136J543350J297760J298371
2303.9G61733475j974716p69043M05960K15301R91211p25326n15747o56357J0986K31781
$$ plain form
2313.5 758947525 759301147 760469208 760363083 759283066 758759079 759826126 759438324 757580719 756067657
2322.2 756067657 755863647 758055649 759396515 758084335 756474152 755881271 755288391 756824265 757958603
2330.9 757958603 757999725 757019730 756196060 757410202 754442520 752946625 754848480 758554916 761468353
2339.6 761468353 760758820 761574402 759239807 762414093 765994034 761408310 759414597 758478928 760054932
2348.3 760054932 762275085 761581039 759924774 760956345 762617111 762466507 760422440 752900696 748699799
2356.9 748699799 750228348 757957382 764582825 758237228 758862457 766044464 762709198 753602600
2364.7 753602600 753318939 760576553 761367874 758692551 760560150 761147690 760445175 764950256 765956573
2373.3 765956573 763594360 764331436 763190842 760448151 760702438 763401718 763947601 763935165 763853378
$$ packed form
2313.5G58947525L53622J168061j06125j080017n23987J067047l87802j857605j513062
2322.2G56067657k04010K192002J340866j312180j610183n92881n92880J535874J134338
2330.9G57958603M1122r79995q23670J214142k967682j495895J901855L706436K913437
2339.6G61468353p09533Q15582k334595L174286L579941m585724j993713r35669J576004
2348.3G60054932K220153o94046j656265J031571J660766j50604k044067p521744m200897
2356.9G48699799J528549P729034O625443o345597O25229P182007l335266r106598
2364.7G53602600k83661P257614P91321k675323J867599N87540p02515M505081J006317
2373.3G65956573k362213P37076j140594k742691K54287K699280N45883j2436q1787
$$ plain form
2382 763853378 762065430 761772385 761701813 763199158 765407639 763157120 761842957 763804016 764847336
2390.7 764847336 765324249 764817657 763879089 764021378 764762497 766008987 764530869 762871399 763904724
2399.4 763904724 763855133 763712692 762911453 762342453 761959915 760141068 761107788 762055588 760601959
2408.1 760601959 760839386 763405151 764831085 764348984 764590530 764851456 764092560 761557388 759765396
2416.7 759765396 760664139 760965347 762113190 763474197 762734146 763088684 761988831 759510269 760075302
2425.4 760075302 759987946 760110016 760786362 759548950 759761810 759275818 758218689 758948822 758823395
2434.1 758823395 758139801 759525375 761389847 760011520 759241638 760597534 759895782 757808151 757653580
2442.8 757653580 758158493 757279053 758182449 758808899 758051605 758514709 758930893 759232483 758390579 757416229
$$ packed form
2382G63853378j787948k93045p0572J497345K208481k250519j314163J961059J043320
2390.7G64847336M76913n06592r38568J42289P41119J246490j478118j659470J033325
2399.4G63904724m9591j42441q01239n69000l82538j818847R66720R47800j453629
2408.1G60601959K37427K565765J425934m82101K41546K60926p58896k535172j791992
2416.7G59765396Q98743L01208J147843J361007p40051L54538j099853k478562N65033
2425.4G60075302q7356J22070O76346j237412K12860m85992j057129P30133j25427
2434.1G58823395o83594J385574J864472j378327p69882J355896p01752k087631j54571
2442.8G57653580N04913q79440R03396O26450p57294M63104M16184L01590q41904r74350
$$ plain form
2452.4 757416229 758248901 759497910 759317398 758176575 757644882 757763672 756688919 753723373 753536072
2461.1 753536072 754679718 754318771 754289703 754390335 755515442 756211243 755980911 755214767 755478134
2469.8 755478134 756432495 756281433 757359543 756375961 754842072 755510178 755716400 755298843 754076538
2478.5 754076538 753982239 754025803 753895035 753384705 752587585 753240738 752625046 752997131 754259186 753127747
2488.1 753127747 752817230 753881912 752602386 750231934 750796204 751873550 751610641 751338654 750413666
2496.8 750413666 749245377 749151306 749262848 749412918 750671234 751493073 752064819 753226624 753319473
2505.5 753319473 751363373 749662018 750518112 750740280 748428955 747655029 750690536 751912155 749985886
2514.1 749985886 749518661 749149170 747826920 747347488 748060760 747383804 746658401 748788300 750064926
$$ packed form
2452.4G57416229Q32672J249009j80512j140823n31693J18790j074753k965546j87301
2461.1G53536072J143646l60947k9068J00632J125107O95801k30332p66144K63367
2469.8G55478134R54361j51062J078110r83582j533889O68106K06222m17557j222305
2478.5G54076538r4299M3564j30768n10330p97120O53153o15692L72085J262055j131439
2488.1G53127747l10517J064682j279526k370452N64270J077346k62909k71987r24988
2496.8G50413666j168289r4071J11542J50070J258316Q21839N71746J161805R2849
2505.5G53319473j956100j701355Q56094K22168k311325p73926L035507J221619j926269
2514.1G49985886m67225l69491j322250m79432P13272o76956p25403K129899J276626
$$ plain form
2522.8 750064926 748221436 745661316 746266479 747740479 748642960 750213470 749715042 748801270 747345657
2531.5 747345657 746106949 747190933 747924957 747656631 746337433 744383469 743453217 744003372 744435272
2540.2 744435272 745611267 746499023 744910736 744563446 745543060 746814041 748267212 747784195 745456238
2548.9 745456238 744701920 745766678 744868622 743898544 744915466 747081528 747114868 745207443 745327606
2557.5 745327606 744427185 743226013 743336792 743418503 744272232 743925400 742744827 743133621 742538910
2566.2 742538910 740490875 741735001 743451157 743414841 743178253 742173538 742521210 741754303 740863571
2574.9 740863571 741484985 741051559 741322403 741811371 741761703 741410141 741305466 740134201 739648972 741576157
2584.5 741576157 741929245 742577209 741758041 739708786 740408554 741061630 740536499 737555313 735783844
$$ packed form
2522.8G50064926j843490k560120O05163J474000R02481J570510m98428r13772j455613
2531.5G47345657j238708J083984P34024k68326j319198j953964r30252N50155M31900
2540.2G44435272J175995Q87756j588287l47290R79614J270981J453171m83017k327957
2548.9G45456238p54318J064758q98056r70078J016922K166062L3340j907425J20163
2557.5G45327606r00421j201172J10779Q1711Q53729l46832j180573L88794n94711
2566.2G42538910k048035J244126J716156l6316k36588j004715L47672p66907q90732
2574.9G40863571O21414m33426K70844M88968m9668l51562j04675j171265m85229J927185
2584.5G41576157L53088O47964q19168k049255O99768O53076n25131k981186j771469
$$ plain form
2593.2 735783844 737161865 737642136 737739563 737727127 737644043 737808990 737657013 737640839 738054352 737970047
2602.9 737970047 738549271 738443909 735122986 733754578 734222946 734171143 735857544 737088394 737092514
2611.5 737092514 736893082 735997620 735664902 735952606 734525757 733388824 733758698 733930893 735207062
2620.2 735207062 735078583 733340988 732412186 731114349 730264816 731503525 733712616 732177811 730393219
2628.9 730393219 731823273 731305313 729863510 729069443 729083557 728919678 729267578 731692734 731251678
2637.6 731251678 730560379 731278915 730683899 730345078 728216476 726605606 726552734 725402756 726474228
2646.3 726474228 727750778 726809082 726349792 724932938 724318542 725907974 725856094 725737991 725802765
2654.9 725802765 724308243 723606415 724469070 725545425 725663834 725634918 724962311 723827591 723670349
$$ packed form
2593.2G35783844J378021M80271R7427j2436q3084J64947j51977j6174M13513q4305
2602.9G37970047N79224j05362l320923j368408M68368n1803J686401J230850M120
2611.5G37092514j99432q95462l32718K87704j426849j136933L69874J72195J276169
2620.2G35207062j28479j737595r28802j297837q49533J238709K209091j534805j784592
2628.9G30393219J430054n17960j441803p94067J4114j63879L47900K425156m41056
2637.6G31251678o91299P18536n95016l38821k128602j610870n2872j149978J071472
2646.3G26474228J276550r41696m59290j416854o14396J589432n1880j18103O4774
2654.9G25802765j494522p01828Q62655J076355J18409k8916o72607j134720j57242
$$ plain form
2663.6 723670349 723575592 723632355 722497864 721011124 721724854 723544312 723881454 722054214 721978226
2672.3 721978226 721871948 718956451 717840576 718864441 719688644 720440216 720452652 719697876 720250626
2681 720250626 720817795 719955292 719817963 719563675 718438416 717147980 716845474 718170624 718459091
2689.6 718459091 716748428 715134735 715213242 715849838 716725006 717285004 716458969 716192627 715949326
2698.3 715949326 715514755 715224838 715904465 717229309 715186615 713772812 714313889 713986130 714959335
2707 714959335 715287018 714474487 713139038 712398224 712906036 711038971 708861084 709380951 710772858
2715.7 710772858 710686264 710457230 709787064 707630157 708686676 710370560 710177002 711056747 710945587
2724.4 710945587 709589081 709316788 709777756 707848206 705764313 706455460 707654953 708573914 707464218
$$ packed form
2663.6G23670349r4757N6763j134491j486740P13730J819458L37142j827240p5988
2672.3G21978226j06278k915497j115875J023865Q24203P51572J2436p54776N52750
2681G20250626N67169q62503j37329k54288j125259j290436l02506J325150K88467
2689.6G18459091j710663j613693P8507O36596Q75168N59998q26035k66342k43301
2698.3G15949326m34571k89917O79627J324844k042694j413803N41077l27759R73205
2707G14959335L27683q12531j335449p40814N07812j867065k177887N19867J391907
2715.7G10772858q6594k29034o70166k156907J056519J683884j93558Q79745j11160
2724.4G10945587j356506k72293M60968j929550k083893O91147J199493R18961j109696
$$ plain form
2733 707464218 706990891 708298492 707138138 706229095 706344147 705280304 705403824 705983124 705149384
2741.7 705149384 704830551 705523682 706719437 706595535 704472427 702499237 700862350 700898209 702213745
2750.4 702213745 702981339 702019272 699931946 700099716 700150299 699589767 701255035 702911835 701301727
2759.1 701301727 699099197 699635239 698803635 697081833 696721115 697541580 699327164 698765488 697841721
2767.8 697841721 697793961 697788849 698113861 696423950 693668060 693080063 694305344 694824219 694792938 694992142
2777.4 694992142 695102615 693950500 692624359 692427292 691085815 689692612 689667664 690726852 690940552
2786.1 690940552 690982513 691962433 690692062 689275360 688205566 688659973 689452362 687123718 686810150
2794.8 686810150 687574234 688411331 688957672 686474228 684536285 685250549 686218948 684700012 683642654
$$ packed form
2733G07464218m73327J307601j160354r09043J15052j063843J23520N79300q33740
2741.7G05149384l18833O93131J195755j23902k123108j973190j636887L5859J315536
2750.4G02213745P67594r62067k087326J67770N0583n60532J665268J656800j610108
2759.1G01301727k202530N36042q31604j721802l60718Q20465J785584n61676r23767
2767.8F97841721m7760n112L25012j689911k755890n87997J225281N18875l1281J99204
2777.4F94992142J10473j152115j326141j97067j341477j393203k4948J059188K13700
2786.1F90940552M1961R79920j270371j416702j069794M54407P92389k328644l13568
2794.8F86810150P64084Q37097N46341k483444j937943P14264R68399j518936j057358
$$ plain form
2803.4 683642654 683673401 683848953 683758240 680896683 679382706 680149307 680423431 678895645 677214508
2812.1 677214508 678158722 678186722 677138290 676716919 676074448 674567490 673497238 674683762 674982758
2820.8 674982758 673501434 672559967 673134079 673094254 670480118 668699036 669107437 668975830 667742691
2829.5 667742691 668191299 669909821 670205460 668553162 665070572 663281784 663325577 661883011 660276718
2838.2 660276718 659144669 658499222 658432541 657350159 654991837 652909393 651372223 649240875 647441177
2846.8 647441177 644754181 640418396 637931480 636907883 635607910 635656815 637336273 637245026 634958916
2855.5 634958916 633984642 634229851 633447838 632842865 634203606 634107399 633974495 637043686 637372437
2864.2 637372437 633650398 630768738 630202560 628642960 625526848 624612503 625520172 625066872 622106819
$$ packed form
2803.4F83642654L0747J75552r0713k861557j513977P66601K74124j527786j681137
2812.1F77214508R44214K8000j048432m21371o42471j506958j070252J186524K98996
2820.8F74982758j481324r41467N74112l9825k614136j781082M08401j31607j233139
2829.5F67742691M48608J718522K95639j652298l482590j788788M3793j442566j606293
2838.2F60276718j132049o45447o6681j082382k358322k082444j537170k131348j799698
2846.8F47441177k686996m335785k486916j023597j299973M8905J679458r1247k286110
2855.5F34958916r74274K45209p82013o04973J360741r6207j32904L069191L28751
2864.2F37372437l722039k881660n66178j559600l116112r14345R07669m53300k960053
$$ plain form
2872.9 622106819 621704140 623635788 623754692 624108162 623695183 622274780 621130409 619936562 618848610
2881.6 618848610 618849869 618035927 615511246 616237488 616900749 615794525 615103264 613230553 613105240
2890.2 613105240 613771400 612328796 610177193 610652351 611436424 609619370 608543663 607771530 607642365
2898.9 607642365 607210655 605335464 604252586 604435310 604118309 601355972 599919167 600758781 601641808
2907.6 601641808 601133804 600151749 600374680 599239807 598073769 596376915 594021072 593971291 595307922
2916.3 595307922 594988365 592537155 591963348 591090889 588729706 588203278 589483299 589564209 587399635
2925 587399635 586727867 586425667 587179070 589849129 591196289 590103836 588596649 588442764 587331581
2933.6 587331581 588477173 590294037 589789162 590376778 590770836 591262817 591203423 590726433 590486031
$$ packed form
2872.9F22106819m02679J931648J18904L53470m12979j420403j144371j193847j087952
2881.6F18848610J259q13942k524681P26242O63261j106224o91261j872711j25313
2890.2F13105240O66160j442604k151603M75158P84073j817054j075707p72133j29165
2898.9F07642365m31710j875191j082878J82724l17001k762337j436805Q39614Q83027
2907.6F01641808n08004r82055K22931j134873j166038j696854k355843m9781J336631
2916.3E95307922l19557k451210n73807q72459k361183n26428J280021Q0910k164574
2925E87399635o71768l02200P53403K670059J347160j092453j507187j53885j111183
2933.6E87331581J145592J816864n04875N87616L94058M91981n9394m76990k40402
$$ plain form
2942.3 590486031 591052856 592756348 592206154 591879234 592166023 592618408 594865723 595273323 592636986
2951 592636986 590013924 590549049 591629677 589698486 587985992 588670349 590456505 591760368 590774689
2959.7 590774689 590070610 590908089 590213165 589411240 589264336 589698753 589847412 590029144 593072929
2968.3 593072929 594983101 594887962 595923958 596878738 596392975 596686440 598129272 598634338 600390816
2977 600390816 602624054 604892540 607149162 607716789 608107681 608023186 608695526 609416199 609105682 609810066
2986.7 609810066 611646194 612150803 611000404 613083878 615722351 615745659 615964241 616138954 615536232
2995.3 615536232 614729843 615080986 615578651 616130791 616068573 615537262 616363373 616641808 617078056 617022324
3005 617022324 616734810 616943626 615733910 615288200 616020432 617890167 619617958 618732071 616304703
$$ packed form
2942.3E90486031N66825J703492n50194l26920K86789M52385K247315M07600k636337
2951E92636986k623062N35125J080628j931191j712494O84357J786156J303863r85679
2959.7E90774689p04079Q37479o94924q01925j46904M34417J48659J81732L043785
2968.3E93072929J910172r5139J035996R54780m85763K93465J442832N05066J756478
2977F00390816K233238K268486K256622N67627L90892q4495O72340P20673l10517P04384
2986.7F09810066J836128N04609j150399K083474K638473K3308K18582J74713o02722
2995.3F15536232q06389L51143M97665N52140o2218n31311Q26111K78435M36248n5732
3005F17022324k87514K08816j209716m45710P32232J869735J727791q85887k427368
$$ plain form
3013.7 616304703 615181427 616136780 614901047 614107933 616336632 615550232 613969498 614688492 615153694
3022.4 615153694 614662056 613027534 612621956 613144875 612478523 612726898 613421326 612502785 611751366
3031 611751366 612303505 610359726 608680153 610190392 608965492 607376099 607640190 607232132 606752548
3039.7 606752548 606028976 605977211 604979401 603140182 601993675 601797028 603343277 603792839 602222633
3048.4 602222633 599914207 599367294 599668427 597740173 597613297 598889771 597602425 597317009 598835602
3057.1 598835602 598101044 596569824 595503960 593973579 594271431 595619850 595189552 594327278 593726730
3065.7 593726730 592910347 592496567 590907402 589978561 590982628 590277863 589191246 587884598 586390152
3074.4 586390152 586864586 586462440 585685577 587389107 588848953 588825302 588865547 586748390 584316902
$$ packed form
3013.7F16304703j123276R55353j235733p93114K228699p86400j580734P18994M65202
3022.4F15153694m91638j634522m05578N22919o66352K48375O94428r18541p51419
3031F11751366N52139j943779j679573J510239j224900j589393K64091m08058m79584
3039.7F06752548p23572n1765r97810j839219j146507j96647J546249M49562j570206
3048.4F02222633k308426n46913L01133j928254j26876J276474j287346k85416J518593
3057.1E98835602p34558j531220j065864j530381K97852J348419m30298q62274o00548
3065.7E93726730q16383m13780j589165r28841J004067p04765j086617j306648j494446
3074.4E86390152M74434m02146p76863J703530J459846k3651M0245k117157k431488
$$ plain form
3083.1 584316902 584661598 585629425 585454140 583428383 582064857 581199188 580482674 579586258 577751389
3091.8 577751389 578617859 579736099 580445366 580215340 578455582 579228477 579124794 577475090 576093063
3100.5 576093063 576514969 577478065 575842781 575762596 574070930 570275230 571691666 573316383 571440697
3109.1 571440697 570792542 569796677 568156776 569086609 570234871 569692001 568484230 567784691 567023392
3117.8 567023392 566158676 565673828 565107841 563807182 561681366 561449509 560193481 558501511 559674149
3126.5 559674149 559427795 558173332 556086159 554436340 554908943 555860481 557205124 555611801 551770477
3135.2 551770477 549820023 551796646 554023705 552647934 550612831 548605080 547082520 546265602
3142.9 546265602 545403252 545274963 544977150 544261360 544189758 542950401 540602303 541405907 542738266
$$ packed form
3083.1E84316902L44696R67827j75285k025757j363526q65669p16514q96416j834869
3091.8E77751389Q66470J118240P09267k30026j759758P72895j03683j649704j382027
3100.5E76093063M21906R63096j635284q0185j691666l795700J416436J624717j875686
3109.1E71440697o48155r95865j639901R29833J148262n42870j207771o99539p61299
3117.8E67023392q64716m84848n65987j300659k125816k31857j256028j691970J172638
3126.5E59674149k46354j254463k087173j649819M72603R51538J344643j593323l841324
3135.2E51770477j950454J976623K227059j375771k035103k007751j522560q16918
3142.9E46265602q62350j28289k97813p15790p1602j239357k348098Q03604J332359
$$ plain form
3151.6 542738266 540791969 538049660 536782494 536276245 535460739 534953613 534243927 533732071 533004265
3160.3 533004265 531963043 531684799 531210251 530221100 529115486 528530464 527190781 526364708 526053543
3168.9 526053543 525473709 525992889 524876480 523127098 521258812 520759201 520822067 518159790 517024307
3177.6 517024307 516107750 515540161 516380081 516942368 516726418 515132141 514573250 511529884 508381310
3186.3 508381310 509002190 508203011 505602722 503855515 504329453 504995461 505208931 504951706 502805748
3195 502805748 499980545 498869858 499679375 499174461 498020973 497356720 497360802 498607750 498670006 495613327
3204.6 495613327 492777328 493424568 493376923 493142395 492986374 489833488 487153473 486810570 487402802
3213.3 487402802 486307755 486166801 487007561 485124245 483089447 482041283 482208824 481502075 480706406
$$ packed form
3151.6E42738266j946297k742309j267166n06249q15506n07126p09686n11856p27806
3160.3E33004265j041222k78244m74548r89151j105614n85022j339683q26073l11165
3168.9E26053543n79834N19180j116409j749382j868286m99611O2866k662277j135483
3177.6E17024307r16557n67589Q39920N62287k15950j594277n58891l043366l148574
3186.3E08381310O20880p99179k600289j747207M73938O66008K13470k57225k145958
3195E02805748k825203j110687Q09517n04914j153488o64253M082J246948O2256l056679
3204.6D95613327k835999O47240m7645k34528j56021l152886k680015l42903N92232
3213.3D87402802j095047j40954Q40760j883316k034798j048164J67541p06749p95669
$$ plain form
3222 480706406 482403946 482391968 479518929 477540779 477201271 476244659 475737381 475816689 476214752 476511040
3231.6 476511040 475330620 475146255 474628830 472666893 470310020 468941803 469293137 468334961 467648735
3240.3 467648735 468050308 467348938 466273041 466125870 465899658 464999161 464334412 463030167 462166290
3249 462166290 460944672 460046806 460927582 460242844 459600601 459338036 458276253 458807182 459499130 457750511
3258.6 457750511 455579529 455755768 456227913 455148087 453308258 452189941 451556587 450208588 450742493
3267.3 450742493 452356873 451993332 451361084 451087990 449232903 446533470 445421829 445778389 445451469
3276 445451469 443698654 442952385 443588257 443274193 442454720 442728195 443761711 443881035 443202286 442249374
3285.6 442249374 441188507 440712433 440056458 439950600 439787903 439335937 440253639 439477348 436891708
$$ packed form
3222D80706406J697540j1978k873039j978150l39508r56612n07278P9308L98063K96288
3231.6D76511040j180420j84365n17425j961937k356873j368217L51334r58176o86226
3240.3D67648735M01573p01370j075897j47171k26212r00497o64749j304245q63877
3249D62166290j221618q97866Q80776o84738o42243k62565j061783N30929O91948j748619
3258.6D57750511k170982J76239M72145j079826j839829j118317o33354j347999N33905
3267.3D50742493J614380l63541o32248k73094j855087k699433j111641L56560l26920
3276D45451469j752815p46269O35872l14064q19473K73475J033516J19324o78749r52912
3285.6D42249374j060867m76074o55975j05858j62697m51966R17702p76291k585640
$$ plain form
3294.3 436891708 435953217 437389297 437695999 434198761 432717247 434122887 433366776 430127716 428254433
3303 428254433 431132622 433697281 432101707 429043388 428333359 431095543 430666008 427451172 427201271
3311.7 427201271 427082253 425882454 425627251 425026436 424408455 424917374 425738640 425988083 423607597
3320.3 423607597 421119652 421279984 421074562 420831070 420452232 419226532 418055801 417114258 417409058
3329 417409058 416963234 415682755 414857674 413403702 412145576 412234497 413558388 413573036 411410332
3337.7 411410332 409662132 409015923 409302330 409257469 407392845 405240173 404231834 403181534 400999565
3346.4 400999565 399391136 399936714 400364799 399452591 399001846 398619270 397093964 395211601 394138718
3355.1 394138718 394480324 394795189 392650185 390599785 391676483 393453140 393703232 392358246 390824585
$$ packed form
3294.3D36891708r38491J436080L06702l497238j481514J405640p56111l239060j873283
3303D28254433K878189K564659j595574l058319p10029K762184m29535l214836k49901
3311.7D27201271j19018j199799k55203o00815o17981N08919Q21266K49443k380486
3320.3D23607597k487945J60332k05422k43492l78838j225700j170731r41543K94800
3329D17409058m45824j280479q25081j453972j258126Q8921J323891J4648k162704
3337.7D11410332j748200o46209K86407m4861j864624k152672j008339j050300k181969
3346.4D00999565j608429N45578M28085r12208m50745l82576j525306j882363j072883
3355.1C94138718L41606L14865k145004k050400J076698J776657K50092j344986j533661
$$ plain form
3363.7 390824585 389614029 387984543 386878967 387183838 387045708 384954987 384704247 385566826 383676109
3372.4 383676109 381597061 379693604 378053398 377692833 376585999 375096626 375682373 377556725 377170448
3381.1 377170448 375566940 374158020 372788696 373281784 373794823 372744637 371180840 370857658 371309242
3389.8 371309242 370365372 371053352 371796112 371184616 372053719 370568733 368831253 368138390 366987267
3398.4 366987267 367569084 366308556 365698509 366637840 366086426 365847816 364389877 364158478 365147514
3407.1 365147514 364541626 364041100 363984528 363779373 362760582 362956734 363353348 361819191 361023827
3415.8 361023827 360707664 358762665 358230057 359335022 357411957 356909256 359770584 361848030 361205482
3424.5 361205482 357965660 357932587 360350456 362062798 363123970 361991844 359821930 359779472 361746826
$$ packed form
3363.7C90824585j210556j629486j105576L04871j38130k090721k50740Q62579j890717
3372.4C83676109k079048j903457j640206l60565j106834j489373N85747J874352l86277
3381.1C77170448j603508j408920j369324M93088N13039j050186j563797l23182M51584
3389.8C71309242r43870O87980P42760o11496Q69103j484986j737480o92863j151123
3398.4C66987267N81817j260528o10047R39331n51414k38610j457939k31399R89036
3407.1C65147514o05888n00526n6572k05155j018791J96152L96614j534157p95364
3415.8C61023827l16163j944999n32608J104965j923065n02701K861328K077446o42548
3424.5C61205482l239822l3073K417869J712342J061172j132126k169914m2458J967354
$$ plain form
3433.2 361746826 360372047 359039116 360966682 360605164 358527069 358714638 360823441 361316795 362670822
3441.8 362670822 364247742 363213768 364405365 364858589 362104836 360604401 361714859 362914772
3449.6 362914772 363172455 363425941 365062332 366807404 365714264 364973526 366571693 368090172 368498878
3458.2 368498878 368824997 368945541 368158722 369632835 370888062 370646019 371482239 373172913 375180321
3466.9 375180321 374328346 373049545 373441238 373249168 372259636 372889977 374701767 374183769 374978256
3475.6 374978256 376866112 378636246 381061401 381199455 380734596 381285210 383146400 384160347 382804756
3484.3 382804756 381196976 382316360 385390091 385263634 384566231 385261116 385056496 384744110 385621147
3493 385621147 387996559 389459686 388801651 388049355 390549774 394540749 396630669 396300011 394216118
$$ packed form
3433.2C61746826j374779j332931J927566l61518k078095J87569K108803M93354J354027
3441.8C62670822J576920j033974J191597M53224k753753j500435J110458J199913
3449.6C62914772K57683K53486J636391J745072j093140p40738J598167J518479M08706
3458.2C68498878L26119J20544p86819J474113J255227k42043Q36220J690674K007408
3466.9C75180321q51975j278801L91693j92070r89532O30341J811790n17998P94487
3475.6C74978256J887856J770134K425155J38054m64859N50614J861190J013947j355591
3484.3C82804756j607780J119384L073731j26457o97403O94885k04620l12386Q77037
3493C85621147K375412J463127o58035p52296K500419L990975K089920l30658k083893
$$ plain form
3501.6 394216118 392719955 392875214 395339203 397002869 396678658 397353516 398898048 399979668 400044174
3510.3 400044174 401784058 404282303 404832993 404344711 404441299 406777191 409037132 409136620 408808022
3519 408808022 409005318 408881721 408837509 409976692 412424126 413749352 413658104 415946121 417947502
3527.7 417947502 417904968 417451935 416959991 418507080 419553299 420557976 423508797 426337013 426270294
3536.4 426270294 424670181 425514374 427117767 428785973 429707108 430376701 430372887 429057808 429681320
3545 429681320 433127136 437430954 438317223 438949585 439786224 440367279 443314514 444816437 446277390
3553.7 446277390 446020317 445931015 447120476 446221046 449015923 452811584 453971710 452751617 452279930
3562.4 452279930 453871117 455697174 460135384 461881027 460880470 459841080 459016800 462816277
$$ packed form
3501.6C94216118j496163J55259K463989J663666l24211O74858J544532J081620O4506
3510.3D00044174J739884K498245N50690m88282R6588K335892K259941R9488l28598
3519D08808022J97296j23597m4212J139183K447434J325226r1248K288017K001381
3527.7D17947502m2534m53033m91944J547089J046219J004677K950821K828216o6719
3536.4D26270294j600113Q44193J603393J668206R21135O69593l814j315079O23512
3545D29681320L445816M303818Q86269O32362Q36639N81055K947235J501923J460953
3553.7D46277390k57073q9302J189461q99430K794877L795661J160126j220093m71687
3562.4D52279930J591187J826057M438210J745643j000557j039390q24280L799477
$$ plain form
3570.1 462816277 466450615 468223228 469182892 471981812 473616524 472330704 473768997 476624031
3577.8 476624031 478995934 479695702 480248642 482836189 484958687 485863762 488326149 492857399 494679680
3586.5 494679680 494098091 494164391 493835144 495856667 499665604 503991776 504779205 505555954 507961273
3595.2 507961273 508580856 512685814 515867767 515011749 515330009 515938187 517982025 521314735 522421989
3603.9 522421989 523976898 528756714 531727562 530976105 533983154 536443596 538185425 542511444
3611.6 542511444 540784836 539844513 544161377 544675598 549525490 552324677 551177673 557444000 559905586
3620.3 559905586 561109772 563598518 564335175 567274284 571124382 574191971 575464554 576777992
3628 576777992 575343323 570879021 575804558 582552910 588163528 589797897 590768661 594218445 596955986
$$ packed form
3570.1D62816277L634338J772613R59664K798920J634712j285820J438293K855034
3577.8D76624031K371903O99768N52940K587547K122498R05075K462387M531250J822281
3586.5D94679680n81589O6300l29247K021523L808937M326172P87429P76749K405319
3595.2E07961273O19583M104958L181953q56018L18260O08178K043838L332710J107254
3603.9E22421989J554909M779816K970848p51457L007049K460442J741829M326019
3611.6E42511444j726608r40323M316864N14221M849892K799187j147004O266327K461586
3620.3E59905586J204186K488746P36657K939109L850098L067589J272583J313438
3628E76777992j434669m464302M925537O748352N610618J634369R70764L449784K737541
$$ plain form
3636.6 596955986 599013329 600158119 602625389 605862274 608840752 610497208 610642815 612256241
3644.4 612256241 616502419 624185715 624332657 620837936 629200668 632049751 626680870 624863510
3652.1 624863510 630277214 634367371 639376106 648104019 641596603 639950562 644648666 646314163
3659.8 646314163 647357025 647422714 650307007 651884918 651872559 654190903 657571869 663173599 667644348
3668.5 667644348 667267532 663347778 658775253 661351700 666641235 672945557 675455627 668182907
3676.2 668182907 667472916 671390381 675127029 673996429 674985733 678401108 679498978 679109726 678433075
3684.9 678433075 679929581 684921341 689566650 680391159 678214493 686968765 682671432 680577850
3692.6 680577850 684666519 685596619 686920395 684653549 682165680 684558411 686175613 687394562
$$ packed form
3636.6E96955986K057343J144790K467270L236885K978478J656456J45607J613426
3644.4F12256241M246178P683296J46942l494721Q362732K849083n368881j817360
3652.1F24863510N413704M090157N008735Q727913o507416j646041M698104J665497
3659.8F46314163J042862O5689K884293J577911j2359K318344L380966N601730M470749
3668.5F67644348l76816l919754m572525K576447N289535O304322K510070p272720
3676.2F68182907p09991L917465L736648j130600R89304L415375J097870l89252o76651
3684.9F78433075J496506M991760M645309r175491k176666Q754272m297333k093582
3692.6F80577850M088669R30100J323776k266846k487869K392731J617202J218949
$$ plain form
3700.3 687394562 690233917 687274475 685353546 692160721 695030746 692768555 692693481 696188278 700071182
3709 700071182 693146439 695761795 703296432 696464920 696927338 697391281 696776352 698900223 701628876
3717.7 701628876 701971588 697612762 697754440 702409058 699900665 698720245 703576584 703800507 705687408
3726.3 705687408 701975327 698508224 702613525 704455185 709665680 707616272 701943359 712528839
3734 712528839 718081512 708428421 699504471 700670013 705352478 705843124 704454575 700670853 704574661
3742.7 704574661 717075653 709293976 692543335 702584686 707543640 714759827 716816406 705770950
3750.4 705770950 716402664 716093674 704282455 705747910 709796143 713284073 706735840 707006989
3758.2 707006989 714195175 712719955 709768829 711963806 711675186 711023865 715998535 713058624 706624527
$$ packed form
3700.3F87394562K839355k959442j920929O807175K870025k262191p5074L494797L882904
3709G00071182o924743K615356P534637o831512M62418M63943o14929K123871K728653
3717.7G01628876L42712m358826J41678M654618k508393j180420M856339K23923J886901
3726.3G05687408l712081l467103M105301J841660N210495k049408n672913J0585480
3734G12528839N552673r653091q923950J165542M682465M90646j388549l783722L903808
3742.7G04574661J2500992p781677j6750641J0041351M958954P216187K056579j1045456
3750.4G05770950J0631714l08990j1811219J465455M048233L487930o548233K71149
3758.2G07006989P188186j475220k951126K194977k88620o51321M974670k939911o434097
$$ plain form
3766.8 706624527 709659805 715938721 719670334 711778336 710813141 712760086 713044281 712736588 711309280
3775.5 711309280 712228928 713540649 717858582 717295609 708899078 710831528 711813965 713104477 715281448
3784.2 715281448 710675888 709226685 710645599 711765823 712670212 712113266 713059540 713709412 713376923
3792.9 713376923 712336578 714379196 720021515 715547485 708040695 710023193 716162796 721810226
3800.6 721810226 713933182 707605515 712588959 714945374 718765869 726058960 718345718 710126190
3808.3 710126190 713251572 713998489 714759216 716513748 715950775 714273376 717404938 716980057 702824936
3817 702824936 708054657 715910263 723371124 726327057 705384140 705495834 709329605 711367722 714216461
3825.7 714216461 715625992 714924164 711622772 711353073 714783096 716209641 711157684 714411011 721943512
$$ packed form
3766.8G06624527L035278O278916L731613p891998r65195J946945K84195l07693j427308
3775.5G11309280R19648J311721M317933n62973q396531J932450R82437J290512K176971
3784.2G15281448m605560j449203J418914J120224R04389n56946R46274O49872l32489
3792.9G13376923j040345K042618N642319m474030p506790J982498O139603N647430
3800.6G21810226p877044o327667M983444K356415L820495P293091p713242q219528
3808.3G10126190L125382P46917P60727J754532n62973j677399L131562m24881j4155121
3817G02824936N229721P855606P460861K955933k0942917J11694L833771K038117K848739
3825.7G14216461J409531p01828l301392k69699L430023J426545n051957L253327P532501
$$ plain form
3834.3 721943512 715843887 712324371 717365494 707845230 707890778 718811722 713498993 709875412
3842.1 709875412 715149918 714785919 712131653 712274094 712735214 713964539 717154388 717775269 720254211
3850.7 720254211 729553604 727465668 725255432 712268906 704737625 710786743 712347946 710476990
3858.4 710476990 710774918 714945908 718414001 710078506 709069901 719216232 717344055 707797928
3866.2 707797928 709316483 713917770 720190811 715922394 706735001 708481216 713972626 717920456
3873.9 717920456 710041656 711767960 716275864 715213089 715776825 718344727 713377533 707747650
3881.6 707747650 713488159 713792267 715159302 721464386 708789444 706829453 709179382 710633850
3889.3 710633850 715527115 715317307 708699799 709031677 712116089 710298157 711744232 713961716 716765366
$$ packed form
3834.3G21943512o099625l519516N041123r520264M5548J0920944n312729l623581
3842.1G09875412N274506l63999k654266J42441M61120J229325L189849O20881K478942
3850.7G20254211R299393k087936k210236j2986526p531281O049118J561203j870956
3858.4G10476990K97928M170990L468093q335495j008605J0146331j872177r546127
3866.2G07797928J518555M601287O273041m268417r187393J746215N491410L947830
3873.9G17920456p878800J726304M507904j062775N63736K567902m967194n629883
3881.6G07747650N740509L04108J367035O305084j2674942j959991K349929J454468
3889.3G10633850M893265k09808o617508L31878L084412j817932J446075K217484K803650
$$ plain form
3898 716765366 719973602 710568771 714326248 716028137 710314102 715604248 715355377 715081863 713532410
3906.7 713532410 710181503 708361359 708322525 711835098 711988754 712054062 712453537 711035385 712194595
3915.3 712194595 713580551 710126724 706522827 708514175 709518661 709395828 711856079 712684250 711876755
3924 711876755 710529861 708919601 709738083 714427795 717199783 712993393 711679230 713885803 712037277
3932.7 712037277 710760956 711133423 711151581 712786179 713644714 712446823 712372131 710967331 711211624
3941.4 711211624 714691544 710694656 707253189 708183441 709207840 712462845 712914429 712688446 711717148
3950.1 711717148 709279633 711209412 712243042 711762543 711337051 710871582 710694427 709603043 709388428
3958.7 709388428 710550766 712803650 712856445 710669937 709585876 709488525 710231781 709619217 709756851
$$ packed form
3898G16765366L208236r404831L757477J701889n714035N290146k48871k73514j549453
3906.7G13532410l350907j820144l8834L512573J53656O5308L99475j418152J159210
3915.3G12194595J385956l453827l603897J991348J004486j22833K460251Q28171q07495
3924G11876755j346894j610260Q18482M689712K771988m206390j314163K206573j848526
3932.7G12037277j276321L72467J8158J634598Q58535j197891p4692j404800K44293
3941.4G11211624L479920l996888l441467R30252J024399L255005M51584k25983r71298
3950.1G11717148k437515J929779J033630m80499m25492m65469j77155j091384k14615
3958.7G09388428J162338K252884N2795k186508j084061r7351P43256o12564J37634
$$ plain form
3967.4 709756851 711537247 709776077 707188034 708780289 709659882 708718262 709133759 707714691 706244583
3976.1 706244583 708018494 710500259 711269531 709796143 708336487 709442673 709315643 706708603 708571777
3984.8 708571777 710941086 710363464 710293961 710613861 712715454 712203369 710491333 711093369 709879074
3993.5 709879074 709144287 709250336 708661346 708554764 709399490 711034927 712116776
4000.2 712116776
$$ packed form
3967.4G09756851J780396j761170k588043J592255Q79593r41620M15497j419068j470108
3976.1G06244583J773911K481765P69272j473388j459656J106186j27030k607040J863174
3984.8G08571777K369309n77622o9503L19900K101593n12085j712036O02036j214295
3993.5G09879074p34787J06049n88990j06582Q44726J635437J081849
4000.2G12116776
##END=$$ End of the data block
