##TITLE=$$ Begin of the data block
##JCAMP-DX=5.00 $$ ACD/SpecManager v 10.08
##SPECTROMETER/DATA SYSTEM=Varian
##DATE=07 Jan 2013 10:46:16
##DATA TYPE=INFRARED SPECTRUM
##DATA CLASS=XYDATA
##ORIGIN=
##OWNER=
##NPOINTS=3735
##FIRSTX=399.26403809
##LASTX=4000.35498047
##MAXX=4000.35498047
##MINX=399.26403809
##MAXY=77.59259033
##MINY=16.95797920
##XFACTOR=1.0000000000
##YFACTOR=0.000000100000000
##FIRSTY=59.27754593
##DELTAX=0.96440572
##XUNITS=1/CM
##YUNITS=TRANSMITTANCE
##XYDATA=(X++(Y..Y))
399.3E92775459K5763359j0336074J1614494n1074791O2209625M5073013p7409172
406E98615913j01136398J6367798K29365501j7417755j84008331m8704949j558685
412.8D91523094m289360K3127213L1821174j00592499q0661201R165497l1333695M7637139
420.5C86397362P7156181N7822037O3689728N9710235r8552780n849953J68475685
427.2G08848495o0305709q3454514J8579559K8940125J3121529j9516869j0199699
434E96012917n4537888j1531448L2168197Q3657036M1990357p5895463m3592185m9463540
441.7E18807983m8007698K1559296K4839935q161621L3179360P9622116l1588402k8348427
449.4E61902542R213791J9598885m111901m9671783J1649895l8336373o2856903N7676621
$$ y = [592775459, 618538818, 608202744, 619817238, 568742447, 630952072, 676025085, 598615913, 497479515, 513847313, 743212814, 725795059, 541786728, 493081779, 491523094, 487233734, 510360947, 542182121, 441589622, 360928421, 370093918, 338760223, 386397362, 463553543, 521375580, 585065308, 644775543, 546222763, 540372810, 708848495, 648542786, 565088272, 583667831, 612607956, 625729485, 606212616, 596012917, 541475029, 529943581, 562111778, 645768814, 687759171, 611863708, 568271523, 518807983, 470800285, 492359581, 517199516, 509037895, 542217255, 621839371, 590250969, 561902542, 571116333, 590715218, 586603317, 536931534, 548581429, 510245056, 447388153, 505064774]
457.1E05064774P2698478q2891540n6623612j534157J5739251M6389961Q690987m3873711
464.8D63660431J5817070N412102l3021584M0771332O0923691j6208916L1257477N0995750
472.6F19607353O065445o4644127o6549339r07555m3201255L103179M634820m6476937
480.3D11631584N0259361J4218865K0988006P5896531L823166J6888732p869529n5923462
488E29913254j7610970L913574M8002358M8941841l7865601l3822708K3130341j3872223
495.7E50729866j8717728l931541l2948990P353439J9401513j3230210j907387K8131104
503.4E34880066M8675423K4542160K3038940k3245735n5403175J3352279r479523k8768501
511.1E27591934m433212N923386j1811219k8161888M2837486N1458397k7852935l5163613
$$ y = [505064774, 577763252, 494871712, 438248100, 436713943, 452453194, 498843155, 507534142, 463660431, 479477501, 484889603, 451868019, 492639351, 553563042, 537354126, 568611603, 619607353, 625672798, 561028671, 494479332, 493571777, 450370522, 453473701, 458108521, 411631584, 461890945, 476109810, 497097816, 572994347, 576817513, 593706245, 585836716, 529913254, 512302284, 516215858, 564218216, 613160057, 575294456, 541471748, 564602089, 550729866, 532012138, 528080597, 495131607, 502485046, 521886559, 508656349, 506748962, 534880066, 583555489, 608097649, 631136589, 607890854, 552487679, 565839958, 556360435, 527591934, 523158722, 529082108, 517270889, 489109001, 531946487, 583404884, 555551949, 520388336]
518.9E20388336n349731J8111496L559723P7896Q893432k1346893l5939178o082268
526.6D82312813p1564R003220K2226715q780060M748154L6644477n289077k4383583
534.3E16411095J4046440K1123543K201538j1692353l1817474k0094261l24860L902321
542D93755989l902855J372605K1696777J3695221K594528P43904P377472L999252j3773079
550.7E27559814O621705K0441589k675514k6049004j5911827q24242J0365334J7614937
558.4E37142792k311287N458603J7935600o454697k6097755j7086220Q399086J0419197
566.1E27405319q465538o413612J4026069J2408333R468460q643150k1226959J5885811
573.8E34444733R039726p845116m303741j9144974j281166J2737617O646767k726478
$$ y = [520388336, 515038605, 533150101, 536709824, 536787720, 545681152, 524334259, 488395081, 482312813, 482241249, 491244469, 513471184, 504691124, 509439278, 546083755, 540794678, 516411095, 530457535, 551581078, 553782616, 542090263, 510272789, 490178528, 489853668, 493755989, 489853134, 491225739, 512922516, 526617737, 529212265, 529956169, 537333641, 541332893, 527559814, 534181519, 554623108, 551947594, 525898590, 509986763, 509162521, 519527855, 537142792, 534831505, 540290108, 558225708, 551771011, 525673256, 508587036, 516986122, 527405319, 518939781, 512526169, 526552238, 538960571, 548429031, 539785881, 518558922, 534444733, 543484459, 535639343, 531335602, 512190628, 510909462, 523647079, 530293846, 527567368]
581.5E27567368J361389L914451j7158241L86086K3102455K302437j3520165l836288
589.3E24119492P828826M656601m847374j2253265l872604J4949951N977249j7461777
597E19097099j0883026J557732l531113J205406L893090o892739m960899L513870O100884
605.6E09100304N378379l321762o749839q259774k1669769l2765808j5151939J2483940
613.4D39043732J796150m770699N480385p285614j2174454j4832344j1496429n012436
621.1C90748291m426575R289399k09122j1874733N977592J3073654J7201920L5157700
628.8D54938126J6766204p031288J2606240m94156j0259018k612725j5636863j2555847
636.5D35720673r969025K27814P874717P119599K310066m74434K9834328L1947288
$$ y = [527567368, 528928757, 532843208, 515684967, 516071053, 539173508, 541475945, 527955780, 524119492, 531948318, 536604919, 531757545, 519504280, 515631676, 530581627, 536558876, 519097099, 508214073, 509771805, 506240692, 507446098, 511339188, 504446449, 499485550, 502999420, 509100304, 514478683, 511156921, 504407082, 496147308, 474477539, 441711731, 426559792, 439043732, 440839882, 436069183, 441549568, 434263954, 422089500, 407257156, 395760727, 390748291, 386321716, 395611115, 395401993, 383527260, 389504852, 402578506, 419780426, 454938126, 471704330, 464673042, 477279282, 476785126, 466526108, 463913383, 448276520, 435720673, 425751648, 425979462, 433854179, 440973778, 443283844, 442809410, 472643738, 504591026]
644.2E04591026J2175370P601585J214790m309463R290237L1723709K945786j9965782
651.9E45267258l408585O335182M953919r167366j229668J9757347J5670891r913521
659.7E68265457j3313637J2358361p53785j9440078P126693K2022019J1105995j663322
667.4E85707703j2570076k285958m408302m140320o559105L651238J0372047m109726
675.1E65657501j533470Q492966N247230J003685Q820648O974755j2325630j0691262
682.8E71646423k280616o389771J194382J6782150Q841820q178826k557220O71005
690.5E79729347p755928j3586159J771355J7562790j020355j2795677o212120j909714
698.2E55783539N319671K096367j1920776j2726898J833648M248734m920044j64795
$$ y = [504591026, 516766396, 524367981, 525582771, 521273308, 530563545, 562287254, 565233040, 545267258, 541858673, 548193855, 553147774, 543980408, 542750740, 562508087, 578178978, 568265457, 554951820, 567310181, 566556396, 547116318, 554243011, 576265030, 587371025, 585707703, 573137627, 570851669, 566443367, 562303047, 555743942, 559395180, 569767227, 565657501, 564124031, 572616997, 577864227, 578867912, 587688560, 594663315, 582337685, 571646423, 569365807, 562976036, 564170418, 580952568, 589794388, 581615562, 579058342, 579729347, 571973419, 558387260, 560158615, 577721405, 576701050, 563905373, 557693253, 555783539, 561103210, 563199577, 551278801, 538551903, 540385551, 544634285, 539714241, 539549446]
705.9E39549446R705811Q699913M741745K902259K403870K450867l115921n830002
713.7E61507988K394104R062271K948952P75795O898804K274513L675575R468117o23780
722.3E98382339p575149k300453L954925K409249L32336K721481P276421J0908699
730.1F16109848p023544k2970429r469604j996804k5634M292412L524322Q185196P13463
738.7E91339226r578820m471969L275833P087708J65519p799072o712189J806488K375603
747.4E77488327O032906K0573616J0284118l154793l564224o196594J891289J2742157
755.1F16096802J2760238J439858j1776734n896873R328651K063942n774459l559609
762.8F14681816k750969J2870827J6351509k079315j0596352N66902L728562q385048
$$ y = [539549446, 549255257, 557955170, 562696915, 565599174, 568003044, 570453911, 567337990, 561507988, 563902092, 572964363, 575913315, 576689110, 583587914, 585862427, 589538002, 599006119, 598382339, 590807190, 588506737, 592461662, 594870911, 595203247, 597924728, 605201149, 616109848, 609086304, 586115875, 576646271, 574649467, 574623833, 578916245, 582440567, 590625763, 591339226, 581760406, 577288437, 580564270, 587651978, 587817497, 580018425, 573306236, 575112724, 577488327, 583521233, 604094849, 614378967, 611224174, 607659950, 601463356, 603354645, 616096802, 628857040, 630296898, 618520164, 612623291, 621951942, 624015884, 618241425, 614681816, 611930847, 624801674, 641153183, 639073868, 628477516, 629044418, 632772980, 624387932]
770.6F24387932n814018n14565O881180P803955j077080J860733K838669k708321r307823
779.2F24350662L33481J1167145J0476379P621079k058792K072830m448929j3207130
787F36306725M151954R328461M027939O943130P076569j15509k196427n173797k193604
795.6F58155441J1396027N064316r999466j6455841r761811J0208817J3167953Q122712
803.4F69898148O332931p528534m240875Q409882m353714j2400437k209396K923507
811.1F56831512m805069q563995K720261J1308746L395691m009705N47409r02404K458114
819.7F58980560K897492j1193466N083694J8005829q296051j7353745q34579R917221
827.5F57206955L559113o866684j836472K863998j0660781r959565L471070N203094
$$ y = [624387932, 618573914, 618059349, 624940529, 632744484, 631667404, 633528137, 636366806, 633658485, 624350662, 624684143, 635851288, 646327667, 653948746, 651889954, 653962784, 649513855, 636306725, 640458679, 649787140, 653815079, 660758209, 667834778, 667719269, 665522842, 660349045, 658155441, 669551468, 674615784, 664616318, 648160477, 638398666, 648607483, 661775436, 669898148, 676231079, 668702545, 664461670, 672871552, 668517838, 656117401, 653908005, 656831512, 652026443, 643462448, 646182709, 657491455, 660887146, 656877441, 657424850, 656522446, 658980560, 661878052, 650684586, 655768280, 673774109, 665478058, 648124313, 647289734, 657206955, 660766068, 653899384, 652062912, 654926910, 644266129, 634306564, 637777634, 642980728]
835.2F42980728j641006q797798l714676o648598j0626335j111641o283493o585617
842.9E97571564O21147m717751k305259J932220j291389j280022j568413j262131M391365
851.6E92091331R451104M141655n672837l301849J860580N206376O159286Q321533
859.3F18257179J6123009M848976P18842N406227o484032n462952K889443J0216827
867F46513519N434799n483551k369384k978440m92782M806289O262894K335053l949585
875.7F50078812k49710K247238l412094j0430298k508927J1393967P933884p488327
883.4F47564545j5539437l752365K804528n20211Q08106n020943l928642q9264k838593
892.1F19487724L685913J431351k680054M048958K878113J493340k197800n195542
$$ y = [642980728, 641339722, 632541924, 628827248, 622178650, 611552315, 610440674, 604157181, 597571564, 598192711, 593474960, 591169701, 593101921, 591810532, 590530510, 588962097, 587699966, 592091331, 601542435, 605684090, 600011253, 596709404, 598569984, 603776360, 609935646, 618257179, 634380188, 639229164, 639948006, 645354233, 638870201, 633407249, 636296692, 646513519, 651948318, 646464767, 644095383, 641116943, 640624161, 645430450, 651693344, 654028397, 650078812, 649829102, 652076340, 648664246, 638233948, 635725021, 647118988, 655052872, 647564545, 632025108, 628272743, 631077271, 630557060, 631365166, 626344223, 622415581, 622326317, 619487724, 623173637, 624604988, 621924934, 625973892, 628852005, 630345345, 628147545, 622952003]
899.8F22952003L180161P398529n1918r174767j720657J639137l409729K905312n547867
908.5F18170204p391128O161804j847344r513931p554665m606399m19464k706986k932930
917.2E87359161k559013k484245M25262O54869k873344n032349q51478m312058p421722
925.8E62905083j78414k462043l718949Q7776j079597k96707j009903o071129m740639
934.5E43435478Q818817J2868500N151291M527359J554146j140824K176018Q160401
942.2E85551186Q026962Q17718L968621Q387832N009270j48849k285119l174629o84738
950.9F05468254R579048P066117p45430P605171N681343j0100403p815208L52554l129006
959.6F13962440k824020J308403m135055q828469m348984l625831n358353n494270
$$ y = [622952003, 626132164, 633530693, 633478775, 624304008, 622583351, 624222488, 620812759, 623718071, 618170204, 610779076, 616940880, 615093536, 605579605, 598024940, 593418541, 592999077, 590292091, 587359161, 584800148, 582315903, 582741165, 583396034, 580522690, 575490341, 574638863, 570326805, 562905083, 562726669, 560264626, 556545677, 556633453, 555553856, 555257149, 554247246, 548176117, 543435478, 552254295, 565122795, 570274086, 574801445, 576355591, 575214767, 577390785, 585551186, 593578148, 594395866, 598364487, 606752319, 611761589, 611612740, 609327621, 606152992, 605468254, 615047302, 622113419, 621367989, 628973160, 634654503, 624554100, 616738892, 617091446, 613962440, 611138420, 612446823, 608311768, 599483299, 595134315, 591508484, 586150131, 580655861]
967.3E80655861k123909L686561j386337o638412k781945J268082J706123j365280
975E73020744r05418N062561O676445l929863o103439K821998o51512n401840k553749
983.7E68035927m79584j264915j861458l328552m139443J22643L11927m874267r790688
992.4E42731590q956222q844757j5453415j1635132L226051J0275269Q402557M489021
1000.1E24234962j743660Q06313J240044m650040N276451K616310j527099M665527
1007.8E30918808l181458p344207r899979k559509M425888l3226P4806m404106j751900
1016.5E06245117l43933m98123k32124o586457q31871k275505o676483j765175k780533
1025.2D84254913n149841o166153m900513l464126k431298j667556q46215k062683
$$ y = [580655861, 578531952, 582218513, 580832176, 574193764, 571411819, 572679901, 574386024, 573020744, 572115326, 577177887, 583854332, 579924469, 573821030, 576643028, 575991516, 570589676, 568035927, 567556343, 566291428, 564429970, 561101418, 556961975, 557084618, 557396545, 552522278, 542731590, 533775368, 524930611, 509477196, 497842064, 501068115, 511343384, 519745941, 524234962, 522491302, 523297615, 524537659, 519887619, 525164070, 527780380, 526253281, 530918808, 527737350, 520393143, 510493164, 507933655, 512359543, 512326317, 512401123, 507997017, 506245117, 505901184, 505403061, 505170937, 498584480, 497752609, 495477104, 488800621, 487035446, 484254913, 479105072, 472938919, 468038406, 464574280, 462142982, 460475426, 459629211, 457566528]
1032.9D57566528n691719j257438M729194K412186j562119p064361p428360K608795
1040.6D44312706L159828N82009k268754j332016P201348l795090o109581L501320
1048.3D45251770N274506L202133m788399k008324m8065L463021M397392O447J262779
1057D56013260l991966k957611J116905J170387n247879l488884J590233m995804K993965
1065.7D42202606L634377l97225J04180J47018M520683m580421o674538Q13332O558151
1074.4D46328163J652451o205712k815399n257950r26323L825379J241264K193833
1082.1D40035706j054573j847535L124390k29187o910782n166244N951K961387o964760
1090.7D23954353r790039k324447l612519n645981r092254k822151o252442j6673622
$$ y = [457566528, 451874809, 450617371, 455346565, 457758751, 456196632, 449132271, 441703911, 444312706, 447472534, 448054543, 445785789, 444453773, 451655121, 447860031, 441750450, 445251770, 450526276, 453728409, 448940010, 446931686, 446883621, 450346642, 454744034, 454750481, 456013260, 452021294, 449063683, 450180588, 451350975, 446103096, 442614212, 444204445, 439208641, 442202606, 445836983, 445439758, 445543938, 445690956, 450211639, 445631218, 438956680, 439770012, 446328163, 447980614, 441774902, 438959503, 433701553, 432775230, 436600609, 437841873, 440035706, 438981133, 437133598, 440257988, 440028801, 433118019, 427951775, 427957726, 430919113, 423954353, 414164314, 411839867, 408227348, 402581367, 393489113, 390666962, 384414520, 367740898]
1098.5C67740898j1466522o280060k981148r917678j2602196j6302853j4333229l812427
1106.2B90044785j0929852j1529884j0104885n458699m132175q724861q059044j2300511
1113.9B18804874n156593P90482J593094L448486M0512l786907M28867M348583J574898
1122.6B22086296J539898n86357M793186J384659o452065l057270j982021M738903
1130.3B22465229J758556n11989O82545o648884o633644k256642k89573l104935q74767
1139B04585896o44036l173752l482055m804039l626519m019870l222637k763157m48971
1147.6A78400860j584072r96876k021294m218826M210224K906380K028580J042308
1155.4A79767284N85766M133263J622581L175335L330441L001289J506672M595070
$$ y = [367740898, 356274376, 349994316, 347013168, 337095490, 324493294, 308190441, 293857212, 290044785, 279114933, 267585049, 257480164, 252021465, 247889290, 239164429, 231105385, 218804874, 213648281, 214438763, 216031857, 219480343, 219520855, 215733948, 216162815, 220511398, 222086296, 223626194, 223039837, 227833023, 229217682, 222765617, 219708347, 217726326, 222465229, 224223785, 223711796, 224394341, 217745457, 211111813, 208855171, 208565598, 205460663, 204585896, 203941860, 200768108, 197286053, 192482014, 188855495, 184835625, 181612988, 178849831, 178400860, 176816788, 175819912, 173798618, 169579792, 173790016, 176696396, 178724976, 179767284, 180353050, 184486313, 186108894, 189284229, 192614670, 195615959, 197122631, 201717701]
1163.1B01717701O426449M154091N348224M165230N283070K771721N026168O909295
1170.8B41801949L978347M998646Q122654J1738339J0028362R784851M665699O532440
1178.5C01651287J0623512P962094J0835457P041473O468353Q272896P693138N402298
1186.2C65950508L019295M778366N973320R275894L690033L557091O933594J965675
1193.9D05143776M480934P512207P389031M046173K991485L567124M658813O352730
1201.6D46142273K564239M514237N536117J519738J769523N542450M112320k25868
1209.4D71475029J517029K147102K951317M1084j006660L920669M053841L817558r69429
1218D87947540k986755j80283K33460M04281j940918J370011L599548N11856j452331
$$ y = [201717701, 208144150, 212298241, 217646465, 221811695, 227094765, 229866486, 234892654, 241801949, 245780296, 250778942, 258901596, 270639935, 280668297, 290453148, 295118847, 301651287, 312274799, 320236893, 331072350, 338113823, 344582176, 352855072, 360548210, 365950508, 368969803, 373748169, 379721489, 388997383, 392687416, 396244507, 403178101, 405143776, 409624710, 417136917, 424525948, 428572121, 431563606, 435130730, 439789543, 446142273, 448706512, 453220749, 458756866, 460276604, 462046127, 467588577, 471700897, 471475029, 472992058, 475139160, 478090477, 478131561, 477124901, 481045570, 485099411, 488916969, 487947540, 484960785, 484780502, 485013962, 485418243, 483477325, 484847336, 488446884, 488958740, 487506409]
1226.7D87506409j649514K049790K833061J120377R5367j177177l42522K95906j223907
1235.4D89507790m03557J340256O06613J215171r0789k22130L444786K197533O3629
1244.1D97659302J736412J678963k5368r27353r77097j69639j234703o14701K288170
1252.8D99413986K420655K196998j822357l288651K159501K059440k48260m43383J18561
1261.4E02566490J767960J599083L548774K322960l452873r05876K045174J292762
1269.2E10784454J942864J562767J475906J755K463036M307937q14743j087456J916657
1277.8E22553177L258514L311272K417908J920890k20298M24461M817963M656944J732979
1286.5E44873810J771278K210312J443901J063881K079964K054710L007050K103767
$$ y = [487506409, 485856895, 487906685, 490739746, 491860123, 491955490, 490778313, 490435791, 490731697, 489507790, 489104233, 490444489, 491051102, 492266273, 492175484, 491953354, 495398140, 497595673, 497659302, 499395714, 501074677, 501049309, 500121956, 499144859, 498975220, 497740517, 497125816, 499413986, 501834641, 504031639, 502209282, 498920631, 501080132, 503139572, 502891312, 502447929, 502566490, 504334450, 505933533, 509482307, 511805267, 508352394, 507446518, 509491692, 510784454, 512727318, 514290085, 515765991, 515767746, 518230782, 522538719, 521723976, 520636520, 522553177, 525811691, 529122963, 531540871, 533461761, 533241463, 533665924, 538483887, 543140831, 544873810, 546645088, 548855400, 550299301, 551363182, 553443146, 555497856, 558504906, 560608673]
1294.2E60608673j539535J367187L745079M885788N372696l2997k140503o53839K491188
1302.9E74103737M479408K888565K381172J223450j294594j986427j92337K163773
1310.6E83766747K653808J021576j74866m20036K135010K739677j636467J15204K382469
1319.3E92583122Q92105J735001O88400j038780l70216O83059L68348J973075K275925
1328E99790039q1406P57981J016960M01764j93253m2305Q71392m42810J399803L157539
1337.6F06635704r37157k211799l18146j323662r31549m59671n69725J170464k08474
1346.3F00845985j389122K153550Q89053k472611l41300L89595j698075j308822J369018
1355E98437271K68707j179275O22978R63097Q7471o50177J226883P14607m097061o55098
$$ y = [560608673, 559069138, 560436325, 564181404, 569067192, 574439888, 574406891, 572266388, 571612549, 574103737, 578583145, 581471710, 583852882, 585076332, 583781738, 581795311, 581602974, 583766747, 586420555, 587442131, 587267265, 586847229, 588982239, 591721916, 590085449, 590200653, 592583122, 593475227, 595210228, 595898628, 594859848, 594489632, 595172691, 595541039, 597514114, 599790039, 599708633, 600466614, 601483574, 601885338, 601692085, 601649780, 602521172, 602078362, 603478165, 606635704, 605698547, 603486748, 603168602, 601844940, 600913391, 600453720, 599883995, 601054459, 600845985, 599456863, 601610413, 602499466, 600026855, 599685555, 600075150, 598377075, 597068253, 598437271, 598705978, 597526703, 598149681, 599112778, 599200249, 598550072, 599776955, 600491562, 596394501, 595739403]
1364.6E95739403L83415j420021j008110r36661m02374j09062j237679j081276J096955
1373.3E91024590r3308l414307m492454j348419M277420K103729r28535j040421j245842
1382E84842453M31061n95551j737327k032013n43175L704262K214126J245575Q69675
1390.7E88399086o561k77977P05375j85508m336167j035347M43535J165657O52466
1399.3E85524559k567635L99743J945114M08859k48489k012902j572609O89926q66546
1408E81700020j710015l50036L47824Q08144j003609k377548j529656O89812J304512
1416.7E77879448j58348L55720l077812j708603J740265L663979M147682j19553P87697
1425.4E83510475P72247j691818j362877j268692N41916J423912J366806P32575J958885
$$ y = [595739403, 596122818, 594702797, 593694687, 592758026, 592355652, 592246590, 591008911, 589927635, 591024590, 590931282, 587516975, 583024521, 581676102, 585953522, 588057251, 587128716, 586088295, 584842453, 585273514, 584677963, 582940636, 580908623, 580365448, 584069710, 586283836, 587529411, 588399086, 588392525, 588114548, 588819923, 588634415, 584298248, 583262901, 583706436, 584872093, 585524559, 582956924, 583356667, 585301781, 585710640, 585462151, 583449249, 581876640, 582566566, 581700020, 579990005, 579639969, 579987793, 580795937, 579792328, 577414780, 575885124, 576574936, 577879448, 577721100, 578076820, 574999008, 573290405, 575030670, 578694649, 582842331, 582722778, 583510475, 584282722, 582590904, 581228027, 579959335, 580501251, 581925163, 583291969, 584024544, 585983429]
1434.1E85983429L127212m36248j370812K248955P78770j250724K85911L802033K029075
1442.7E95197601l64952j79786K086830K463188j601334m540939o74515R03893K727089
1451.4E96017075L922462n72624J233635M538574n1079l336067j117325J77422J68609
1460.1F00980682J989632L238907L088417J834526j135902K363700K573472J794128
1467.8F16727562K205086M61540k54822n37834J000175J455613N122718M982453J795959
1476.5F32958450K620468J556473N67322J296463N56641o48651k139054J417618M910507
1485.2F43096237M566803J064224m144973j355439n840454o12297L782082p32117j091842
1493.8F38732224j286507q75778M42428K639427j402587l930245N89829r36051j868782
$$ y = [585983429, 589110641, 588674393, 587303581, 589552536, 590331306, 589080582, 589366493, 593168526, 595197601, 594832649, 594652863, 596739693, 599202881, 597601547, 593060608, 592386093, 593289986, 596017075, 599939537, 599366913, 600600548, 605139122, 605088043, 601751976, 600634651, 600812073, 600980682, 602970314, 606209221, 609297638, 611132164, 609996262, 612359962, 614933434, 616727562, 618932648, 619394188, 619139366, 618601532, 619601707, 621057320, 626180038, 631162491, 632958450, 635578918, 637135391, 637702713, 638999176, 639555817, 638907166, 636768112, 638185730, 643096237, 647663040, 648727264, 644582291, 643226852, 637386398, 636774101, 640556183, 639824066, 638732224, 637445717, 636569939, 637012367, 639651794, 638249207, 634318962, 634908791, 633972740, 632103958]
1502.5F32103958j836433J392822J958885o683464m482956l204307l739281m372559
1510.2F11136665K451516K508888k053414l311424l649826J43280n175018j569519
1518F00481148M171142K767220K011146l113937j889114n55268k916870q682594J304436
1526.6E93577309M612121J816483k09618k814712k076989r33570k466698m751434K377777
1535.3E89130669K437248j60332J42326p825050Q27828L066482R76830J549644O15997
1544E90761642L871193p129631l818740J181411k9831m75769K268791K134018N66369
1552.7E89329453M280700J580658k829666M462433R538917N484658k6008988N360375
1560.4E91198540Q565483K227173M22821J81007J597672q45719Q3046K083435j474838
$$ y = [632103958, 630267525, 631660347, 633619232, 626935768, 622452812, 619248505, 615509224, 611136665, 613588181, 616097069, 614043655, 610732231, 607082405, 607225685, 602050667, 600481148, 604652290, 607419510, 609430656, 606316719, 604427605, 603872337, 600955467, 592272873, 593577309, 598189430, 600005913, 599796295, 596981583, 594904594, 593971024, 591504326, 586752892, 589130669, 591567917, 591407585, 591549911, 583724861, 584552689, 587619171, 588596001, 590145645, 590761642, 594632835, 587503204, 583684464, 584865875, 584836044, 584360275, 586629066, 588763084, 589329453, 593610153, 595190811, 592361145, 596823578, 606362495, 611847153, 585838165, 591198540, 599764023, 601991196, 602414017, 602595024, 604192696, 603346977, 603430023, 605513458, 604038620]
1569.1F04038620l274689L780785M24843j145478J088143O87179k3193m421730R55963
1577.7F02110443M10423k337494j073112m98581P76596j683197l474579k202987q43964
1586.4E91183548j868935m178123j570435o29081n42145l045311k886734k049523l285408
1595.1E71127853p18574l464317m140511l647194j879463j110153k473221m02947k320098
1603.8E50971375l103333l577652m373245l512001j814614j528816j953277k478180
1611.5E28630257l622361k202224l099594R384l383370r128914P63283l755646m37393
1620.2E03773422q95462j171379l597641o757431J803207M76990N7755m650269j626434
1628.9D87412758J4610j787681j173859k281418N42679K294159M59213r040184m6234
$$ y = [604038620, 600763931, 604544716, 604969559, 603824081, 604912224, 605599403, 605576210, 601154480, 602110443, 602520866, 600183372, 599110260, 598611679, 599388275, 597705078, 594230499, 592027512, 591183548, 589314613, 585136490, 583566055, 582936974, 582394829, 579349518, 576462784, 574413261, 571127853, 570409279, 566944962, 562804451, 559157257, 557277794, 556167641, 553694420, 553291473, 550971375, 547868042, 544290390, 539917145, 536405144, 534590530, 533061714, 531108437, 528630257, 525007896, 522805672, 519706078, 519715462, 516332092, 507203178, 507966461, 504210815, 503773422, 502877960, 501706581, 498108940, 491351509, 493154716, 493631706, 493689461, 489039192, 487412758, 487427368, 485639687, 484465828, 482184410, 482727089, 485021248, 485480461, 476440277, 476394043]
1637.5D76394043J975937J47858J54342k945976k59094J38054J843338O28204j910591
1646.2D76166115K693214k866668L772354K662582J005364K491226P908058j2579842
1653.9D81252403R38530L950463N35583K653923J518440J876679J815033J596222K850799
1662.6D98988075o2446L882980J953888J563606K003746J495590o33544N52825N888978
1671.3E15633698K450752L932075K754212K315674K521286O25076M674377M149208
1679E39056358M751931K160911J308556L024521j24550k336846N054474P706337M189606
1687.7E64791298M203072L462028O88210L289680K951660K603493L395386P351493
1695.4E92736320N344239K046089L428879L494072O347809j421814P990646N468750
$$ y = [476394043, 478369980, 478517838, 478672180, 475726204, 475467110, 475605164, 477448502, 478076706, 476166115, 478859329, 475992661, 479765015, 482427597, 483432961, 485924187, 493832245, 481252403, 482190933, 486141396, 486676979, 489330902, 490849342, 492726021, 494541054, 496137276, 498988075, 498925629, 502808609, 504762497, 506326103, 508329849, 509825439, 509191895, 509744720, 515633698, 518084450, 522016525, 524770737, 527086411, 529607697, 530232773, 534907150, 539056358, 543808289, 545969200, 547277756, 550302277, 550177727, 547840881, 552895355, 560601692, 564791298, 568994370, 572456398, 573144608, 576434288, 579385948, 581989441, 585384827, 592736320, 598080559, 600126648, 603555527, 607049599, 613397408, 611975594, 619966240, 625434990]
1703.1F25434990K364883L776512M555131K708244O80084L284111L566437L523483
1710.8F49893875L277283L103332K533646j813583M324264O655045J196365o037598
1718.5F63132629J625748N345764K566376J352615J241227L96118J605377J586685
1726.3F78852539J125565J213379K787170N69916n89066L727875M323654l183899j3036041
1734.9F75791092O060867P327500K882232J095124l384324p17849M632644K418824
1742.7F96106110K999496L447571J681518J11161K45590K835922K917481K965316Q89740
1751.3G14199905J05668M070205L448487K785644K756119k040329O85043M280853J508866
1760G31800461m93469j669159M663162M792099o28662o75583J960068J543579j829071
$$ y = [625434990, 627799873, 631576385, 636131516, 638839760, 639519844, 642803955, 646370392, 649893875, 653171158, 656274490, 658808136, 656994553, 661318817, 667973862, 669170227, 663132629, 664758377, 670104141, 672670517, 674023132, 675264359, 675660477, 677265854, 678852539, 679978104, 681191483, 683978653, 684548569, 683959503, 687687378, 692011032, 688827133, 675791092, 681851959, 689179459, 692061691, 693156815, 689772491, 689054642, 693687286, 696106110, 699105606, 702553177, 704234695, 704345856, 704591446, 707427368, 710344849, 713310165, 714199905, 714305573, 718375778, 721824265, 724609909, 727366028, 725325699, 726010742, 730291595, 731800461, 731306992, 729637833, 734300995, 739093094, 738464432, 737788849, 739748917, 741292496, 739463425]
1768.7G39463425M67529J396027J42898j504898k749863N484162M731140j916428j54876
1777.4G45359116J506805J697540J37406k037278k98995M45785J132202K496185J13450
1786G50552216r24988J376190J846542O75736j597138j209564m19235k45438J867676
1794.7G51921997K502441J790619J9608J358414L51791j155243O94809l136826j078872
1803.4G53268738L554153L847122k61306k784958N60226K166138Q75244l407059p04116
1812.1G57114182K181625l98102K15607R23233J382828R90676O23856R98306k0523
1820.8G64011688L4867o19812j425629n00870R71985P61642J461716K402649q2016
1829.4G67016220m962311M04663L332596J49002q44574r48944m80118j31836M36554
$$ y = [739463425, 739930954, 741326981, 741469879, 739964981, 737215118, 742699280, 747430420, 745513992, 745359116, 746865921, 748563461, 748700867, 746663589, 746364594, 746810379, 747942581, 750438766, 750552216, 749627228, 751003418, 752849960, 753525696, 751928558, 750718994, 750299759, 750054321, 751921997, 754424438, 756215057, 756234665, 757593079, 757944870, 756789627, 757484436, 754347610, 753268738, 756822891, 760670013, 760408707, 757623749, 758183975, 760350113, 761225357, 757818298, 757114182, 759295807, 758897705, 759113312, 760036545, 761419373, 762410049, 763033905, 764032211, 764011688, 764046555, 763426743, 762001114, 761500244, 762472229, 763233871, 764695587, 767098236, 767016220, 762053909, 762458572, 765791168, 765940170, 765095596, 764146652, 763666534, 763534698, 763971252]
1838.1G63971252L063736K75498m65927O53305J76849r83124m008407K122726K319794
1846.8G67125702K23312L26004J419754Q21762j07803L8605p62711N77698k44598R98916
1856.4G70416641J908417j272278m01001q32519k29035M36020j89972k518n71975J3428
1866.1G69275208m52500J423264N49163j819992J689988J611251J4573N56945J006775
1874.8G73854675r27963j399689m61349J887054J485672j475372J271439J691436j288910
1883.4G74636993j650619j80969l28064j168213N22690P52411q4992q05588o35910
1892.1G71057739j143799o37435J268997m3106J308822K169571N92957n10559j028901
1900.8G73034286k00119J34430N35813l40500K51999J71127k79999P38526j389466
$$ y = [763971252, 767034988, 767310486, 766844559, 767497864, 767674713, 766691589, 762683182, 764805908, 767125702, 767349014, 767675018, 769094772, 769916534, 769808731, 769847336, 769084625, 769662323, 769417725, 770416641, 772325058, 771052780, 770651779, 769819260, 769590225, 770026245, 769836273, 769833755, 769261780, 769275208, 768822708, 770245972, 770795135, 768975143, 770665131, 772276382, 772290955, 772847900, 773854675, 772926712, 771527023, 771065674, 772952728, 774438400, 772963028, 774234467, 775925903, 774636993, 772986374, 772805405, 772477341, 771309128, 771831818, 772584229, 772499237, 771693649, 771057739, 769913940, 769276505, 770545502, 770502396, 771811218, 773980789, 774573746, 774063187, 773034286, 772834167, 772968597, 773504410, 773163910, 773415909, 773587036, 773307037, 774045563, 772656097]
1909.5G72656097l98407Q87452j30997j62583j12686m8065L33023K144623n82809k391968
1919.1G72193680q7280n96924P07321m50592j910858P9803J93329J508789J785812
1927.8G73423080l61023n39855l73917q42056j68610Q30917n29632j537781Q27103
1936.5G70728226J006088m7989J52512l57437l64609j794586r61686L032685J780319
1945.2G73173523j305542n32608j0910J65634J436005L58505j136551j984177l34701
1953.8G69829178R53445L61557R35822j484757j325531J947785O63528j669845j90049
1962.5G70021133Q11234j023102N0202L61023r57795q5983J096649M58679j142120
1971.2G69589920m2648j21155P62405o37436l582382P3471K317124K479629J35498
$$ y = [772656097, 772257690, 773145142, 773014145, 772851562, 772738876, 772690811, 773023834, 775168457, 774585648, 772193680, 772106400, 771509476, 772216797, 771766205, 769855347, 769935150, 770128479, 771637268, 773423080, 773062057, 772522202, 772148285, 771306229, 771137619, 771968536, 771438904, 769901123, 770728226, 771734314, 771686325, 771838837, 771481400, 771116791, 769322205, 768360519, 771393204, 773173523, 771867981, 771335373, 771324463, 771490097, 772926102, 773284607, 772148056, 770163879, 769829178, 770782623, 771144180, 772080002, 770595245, 769269714, 771217499, 771881027, 770211182, 770021133, 770832367, 769809265, 769859467, 770220490, 769262695, 769176712, 770273361, 770732040, 769589920, 769547272, 769426117, 770188522, 769551086, 765968704, 766042175, 768359299, 770838928, 770974426]
1979.9G70974426j168823J016159l25699j632309p70569P7820j293487r29642j49460
1988.6G65798416m60815J722870J307602J8768p66602j258316j262512j64719J059342
1997.2G65994034m30832J56937N83572J21307j49154M15802J470413r94110j322403
2005.9G65845566o92291k71988J145706P41348l34396j624375p69958R81827J201553
2014.6G66222992o81458j660537L04107M08020k45056m95682j388549j195603Q76313
2023.3G62144547K792129J897659j587524k435379k69013m72183n98221m55474Q8577
2032G61105118J416473J32294k29492J271820N68924k056122k490158q25653P86133
2040.6G59679337J03988m35867K217331J391983K83356N60913j892243j960296j79596
$$ y = [770974426, 769805603, 770821762, 770496063, 768863754, 768093185, 768171005, 766877518, 765947876, 765798416, 765337601, 767060471, 768368073, 768386841, 767620239, 766361923, 765099411, 764934692, 765994034, 765563202, 765720139, 766303711, 766425018, 766275864, 766691666, 768162079, 767167969, 765845566, 765153275, 764881287, 766026993, 766768341, 766433945, 764809570, 764039612, 765021439, 766222992, 765541534, 763880997, 764185104, 764593124, 764348068, 763852386, 762463837, 761268234, 762144547, 764936676, 766834335, 765246811, 762811432, 762542419, 762070236, 761472015, 761016541, 761105118, 762521591, 762653885, 762424393, 763696213, 764265137, 762209015, 759718857, 758893204, 759679337, 759783325, 759347458, 761564789, 762956772, 763240128, 763801041, 761908798, 759948502, 759768906]
2049.3G59768906J6861o47278l2501L34396L77502Q83713N24140P9803m69055r30023
2059G59906464j734085p35016n87693M0284K157974l69339M86221J509552j507492
2067.6G59166870j214752l93524j82953p93381p87201O85044N96237j926575j614075
2076.3G53535690J123352l7841q85010q27713K41089J358566q6746j352921j963959
2085G51104507l1204J89133p81097m89502k75269J692886L9902j467056R90219J290207
2094.6G52262726m10919j226654p43485Q02841J975479P02134n11170j218490j112366
2103.3G50520096O7367L75519R71222J573410J834793n78766j390457J030884k37656
2112G54166412j014633N86853O02722q14132j9684Q38394r41238m16871J016770J758118
$$ y = [759768906, 759785767, 759138489, 759105988, 759440384, 759817886, 760701599, 761225739, 761305542, 760836487, 759906464, 758172379, 757437363, 756849670, 756889954, 759047928, 758678589, 759164810, 760674362, 759166870, 757952118, 757558594, 757375641, 756582260, 755795059, 756480103, 757076340, 755149765, 753535690, 754659042, 754621201, 753736191, 752908478, 753149567, 754508133, 754421387, 753068466, 751104507, 751073303, 751262436, 750481339, 749991837, 749716568, 751409454, 751449356, 749982300, 750972519, 752262726, 751851807, 750625153, 749881668, 750684509, 752659988, 753362122, 752850952, 751632462, 750520096, 750587463, 750962982, 751934204, 753507614, 755342407, 754763641, 753373184, 754404068, 754166412, 753151779, 753738632, 754341354, 753527222, 753507538, 754345932, 753404694, 752987823, 754004593, 755762711]
2121.6G55762711L1356j518173j56402p52564L63236J157836K60392p51801l354339
2130.3G51042252j134339K575684K702713j74408k806778o75964J144256M66309r71756
2139G52167969k09961J888809Q14209P32117O00280j973571j715393J481094K027359
2147.7G55812912j005783j224213J466294J750030L07312p64160n49011M56695r4375
2156.4G56155701o94352P5303R81292P19223j130523O11801K024689q38395n13763
2165G57390976q87299j817932N08194Q19397L88794O14243K42538m99878p16324K41700
2174.7G56284409L72085j037826j3352J546707m48684o04401l26080q14514J13449
2183.4G55071793P02362N80673j179352R1248R74655K68783Q47168j211166l32489
$$ y = [755762711, 755794067, 754275894, 754119492, 753366928, 753730164, 754888000, 755148392, 754396591, 751042252, 749907913, 752483597, 755186310, 755011902, 752205124, 751529160, 752673416, 753139725, 752167969, 751958008, 753846817, 754661026, 755393143, 755993423, 754019852, 752304459, 753785553, 755812912, 754807129, 753582916, 755049210, 756799240, 757106552, 756342392, 755793381, 756250076, 756155701, 755461349, 755536652, 756517944, 757237167, 756106644, 756718445, 758743134, 757904739, 757390976, 756503677, 754685745, 755193939, 756013336, 756402130, 757016373, 757258911, 756759033, 756042709, 756284409, 756656494, 755618668, 755605316, 757152023, 756703339, 756098938, 755772858, 754958344, 755071793, 755774155, 756354828, 755175476, 755266724, 756241379, 756510162, 757357330, 756146164, 755813675]
2192G55813675J549988J615829O27823j184540m45862l89328K89460J024246P98187
2200.7G59699478m34494j437073O77491M86908J21688K99683o88400J31683J310959
2209.4G60167923J073990N9967O58569r65957k217560J410599J805725r16977l50113
2218.1G60726166K62527j770477j202087Q3541l662K175980K001877j035385o35529
2226.8G60602951P59659l02963q68302l28598O72989O02646p92618m08096J59988j90353
2236.4G59907303L72543J406555o9580j433181q99888j085662l1968O38123J162720
2245.1G59966965j48087j744537Q83941J465607O81458m38309j03989J101532o0730
2253.8G61603851P51419p31659j663131O56280N34973r3155r9639k01569j464081r58862
$$ y = [755813675, 757363663, 758979492, 759607315, 758422775, 757976913, 757587585, 757877045, 758901291, 759699478, 759264984, 757827911, 758505402, 758992310, 759113998, 759413681, 758725281, 758856964, 760167923, 761241913, 761301880, 761960449, 760994492, 758776932, 760187531, 761993256, 761076279, 760726166, 760988693, 759218216, 758016129, 758099670, 758096008, 760271988, 762273865, 761238480, 760602951, 761362610, 761059647, 760191345, 759862747, 760535736, 761138382, 760345764, 759937668, 760097656, 759907303, 760279846, 761686401, 761616821, 760183640, 759283752, 758198090, 758166122, 758804245, 759966965, 759818878, 758074341, 758958282, 760423889, 761105347, 760667038, 760563049, 761664581, 761603851, 762355270, 761623611, 759960480, 760616760, 761151733, 761058578, 760958939, 760757370, 759293289, 758334427]
2263.4G58334427J105957P25632J012649J447220j740799j985168J663589O97022l46070
2272.1G60914459J41602j25351O71310p74612j400681J05057P23343P14569K33307
2280.8G61203003k38266l01971k57569K84424R98688r00498j228332L0136m08402J716385
2290.4G60897598K508545N0507P9422O53381k209854k293625P67059L69721O89011
2299.1G61511765m6463j476136n83725l92608P10754J74255L69187J436844k33231
2307.8G61470642m51355r51691j12152J934967P36695p44248m57077K620316Q18710
2316.4G64864807m534988k334137l05710L74679k51922k346802L041840L797226l018494
2325.1G59286499m211044K141113L684769k198563r17740R59015j34277j745224r45206
$$ y = [758334427, 759440384, 760166016, 761178665, 762625885, 760885086, 758899918, 760563507, 761260529, 760914459, 761056061, 760930710, 761602020, 760827408, 759426727, 759531784, 760255127, 760969696, 761203003, 760964737, 760662766, 760405197, 760689621, 761688309, 760787811, 759559479, 759589615, 759181213, 760897598, 763406143, 763456650, 763536072, 764189453, 761979599, 759685974, 760453033, 760822754, 761511765, 761465302, 759989166, 759405441, 759012833, 759723587, 759897842, 760267029, 761703873, 761470642, 761019287, 760067596, 759955444, 761890411, 762627106, 761882858, 761425781, 764046097, 764864807, 760329819, 757995682, 757689972, 758064651, 757812729, 755465927, 758507767, 762304993, 759286499, 755075455, 757216568, 760901337, 758702774, 757785034, 758744049, 758609772, 756864548, 755919342]
2333.8G55919342K011948o57196L38440L196411K112350o87408p63474l99170j057358
2342.5G60013885J908417J94855J759338Q29926k436981J673507O43235k812806j818695
2351.2G59954681J640320r65042j693649M234390J921997j187515l342667j578140
2358.9G58984375M470444J350860m112014k286988j57699o7673N317688M044723k548523
2367.6G64995193n396728k508545L494415L826599J414032j277313r25598l00064O82297
2376.2G64004288J669693j351395p81326R32083J96686k85111m64859m28390R16824
2384.9G64408493J774216j184159j622238M25873J279907J390152m2648n01633j341018
2393.6G64586945p85294J535110J218796q28781j111603J29013q28476o31790Q50373
$$ y = [755919342, 757931290, 757274094, 757612534, 760808945, 762921295, 762233887, 761470413, 761071243, 760013885, 761922302, 762117157, 763876495, 764706421, 762269440, 763942947, 764586182, 761773376, 759954681, 761595001, 760629959, 758936310, 763170700, 765092697, 763905182, 760562515, 758984375, 763454819, 764805679, 760693665, 758406677, 758248978, 758181305, 763498993, 767543716, 764995193, 759598465, 757089920, 760584335, 764410934, 765824966, 764547653, 763622055, 763321991, 764004288, 765673981, 764322586, 763541260, 764473343, 764670029, 764384918, 763920059, 763491669, 764408493, 766182709, 764998550, 763376312, 763802185, 765082092, 766472244, 766429596, 765927963, 764586945, 763801651, 765336761, 766555557, 765726776, 764615173, 764744186, 763915710, 763283920, 764134293]
2402.3G64134293N50918m04358j601944q57620N21088P74002R73587M15802J25503
2410.9G64631271N49240j535034j286697K093353P2937j688232l21808n6610J56936
2419.6G62615356k69088L2348Q03528k04773j524353n77774L21045j3962K03324N60531
2429.3G61946182J175766m42047j867599l55606M83856Q89663Q37632q39234k157211
2438G59671402j157379J119842J685639n74265j307296m50974R155J291504K18735
2446.6G60506363o11496L62396Q49304L37067j332703p61642m0207Q7357J92566J69143
2456.3G59758148m72641j146393O48270m42886r39026K36893o46363o0272M62494J096573
2465.9G58494797R7427j016235l36609l58048J67313j43509j075592j349716J04828
$$ y = [764134293, 764685211, 764280853, 762678909, 761821289, 762342377, 763116379, 764089966, 764505768, 764631271, 765180511, 763645477, 762358780, 764452133, 764525070, 762836838, 762515030, 762458420, 762615356, 762346268, 762378616, 763182144, 762977371, 761453018, 760875244, 761196289, 761182327, 761385651, 761946182, 763121948, 762679901, 760812302, 760456696, 760940552, 761830215, 762667847, 761828613, 759671402, 758514023, 759633865, 761319504, 760745239, 759437943, 758986969, 758996124, 760287628, 760506363, 759894867, 760257263, 761106567, 761443634, 760110931, 759349289, 759309082, 759396439, 759589005, 759758148, 759285507, 758139114, 758787384, 758344498, 757405472, 757642365, 756996002, 756935730, 757398224, 758494797, 758592224, 757575989, 757239380, 756881332, 757048645, 756905136, 755829544, 754479828, 754584656]
2474.6G54584656R90600J07041q07572j253662P32727J109772k61154l59039J95465
2483.3G55038834M2419o81763N07584M70886r0637k72522j073990j703567j539994
2492G50697250J908417J760559j803283p39594J762924J102371j355438j099014n70068
2500.6G51664124n60685N98908k01798j70669J324615R69773j349717j672439J017990
2509.3G51620102P3624p82090J079331j29547p76520J81885n02549r55429O80695J48315
2519G50637817j597137N90057Q94394m55169j473694j352539J423339Q35953j20849
2527.6G49382172m0436j35880k15683j105423p63549m35715J790466J485214r34448
2536.3G49026718j130371j828918o67267L34091J483231J057510n95627O23016N92804
$$ y = [754584656, 755575256, 755682297, 754874725, 753621063, 754353790, 755463562, 755202408, 754843369, 755038834, 755081253, 754399490, 754907074, 755377960, 755287323, 755014801, 753940811, 752237244, 750697250, 752605667, 754366226, 752562943, 751823349, 753586273, 754688644, 753333206, 752234192, 751664124, 751103439, 751702347, 751500549, 751329880, 752654495, 753624268, 752274551, 750602112, 751620102, 751693726, 750911636, 751990967, 751861420, 751084900, 751266785, 750764236, 749808807, 750489502, 750637817, 749040680, 749630737, 750525131, 750069962, 748596268, 747243729, 748667068, 749503021, 749382172, 749341736, 749205856, 748990173, 747884750, 747121201, 746685486, 748475952, 749961166, 749026718, 747896347, 746067429, 745400162, 745734253, 747217484, 748274994, 747679367, 748302383, 748895187]
2545G48895187n34896p03736L87726p98798n17501J271896l18451l52783j051026L40729
2554.6G46618347J361542p83310m82025j623459j509247K7084N50385L16925n88989
2563.3G43887253M4327J433181K185746J37634j338959k089310j776733M73633K99225
2572G43255997k08512n98755m35104l45154n12390P07703J311569N50919n71671m50134
2581.6G42704468j927567o00052K179947k47879o00662k77557j83106R01795k11258
2590.3G41738129j061936k023086q06046K692642J725388j077499q49610j256637p69501
2599G38311844L39889L13187J542206k90909j694260j181030m78821J462174l44162
2607.7G37980118j238861n7526Q8196O3858N722P75833n20859j517868j093139J60217
$$ y = [748895187, 748360291, 747656555, 748044281, 747245483, 746727982, 747999878, 747681427, 747328644, 746277618, 746618347, 747979889, 747196579, 746714554, 745091095, 743581848, 743608932, 744159317, 744476242, 743887253, 743931580, 745364761, 747550507, 747688141, 746349182, 744259872, 742483139, 742956772, 743255997, 743047485, 742448730, 742013626, 741668472, 741156082, 741863785, 743175354, 743726273, 743154602, 742704468, 740776901, 740176849, 742356796, 742108917, 741508255, 741230698, 741047592, 741949387, 741738129, 740676193, 738653107, 737847061, 740539703, 742265091, 741187592, 740337982, 739081345, 738311844, 738651733, 738964920, 740507126, 740216217, 738521957, 737340927, 736862106, 738324280, 737980118, 736741257, 736683731, 736771927, 736835785, 736841507, 737617340, 737096481, 735578613, 734485474, 734645691]
2617.3G34645691P07550r79462j83410N02319N25589j06735j678162k67334P16553
2626G33882599N32608p935j47018K25372n01404o36749j677246j799545l98178L16391
2635.6G29788895J366043O22635j19629J6403j086502j019592m30985l88107K62909
2644.3G29012070n9052p85751L02276J51597j609269j166076P50351J487426J94703
2653G28278275j80817L58124n08042o89163o34460q92029p32804Q8959P34177k25983
2662.6G25596237k48260J55105k58941p44782j580810o87867N39551l85513l17383
2671.3G22067337J021347m77753j407318O66199K89383l68195K42768k44370K61688
2680G22051086l2806q38852j135254k067795M06876K589493q81806k404251J124878
$$ y = [734645691, 735353241, 734373779, 734190369, 734692688, 735218277, 735111542, 733433380, 733166046, 733882599, 734415207, 734407272, 734260254, 734485626, 733984222, 733347473, 731670227, 729870682, 729472504, 729788895, 731154938, 731777573, 731657944, 731674347, 730587845, 729568253, 729137268, 728749161, 729012070, 728953018, 728167267, 728469543, 728621140, 727011871, 725845795, 726596146, 728083572, 728278275, 728097458, 728455582, 727947540, 727258377, 726623917, 725731888, 724999084, 725088043, 725822220, 725596237, 725347977, 725503082, 725244141, 724499359, 722918549, 722230682, 722770233, 722384720, 722067337, 723088684, 722610931, 721203613, 721869812, 722159195, 721791000, 722033768, 721789398, 722051086, 722018280, 721179428, 720044174, 717976379, 718383255, 720972748, 720090942, 717686691, 718811569]
2688.7G18811569J824188r74807q33130J50986q55179n88150N78689n01404j510009
2697.4G16102753J001968J267548l60031J264038J46484k335815n53666P82395o23474
2706G16692200j019898j311722j431427M23584n2337J37481J174698m80575n77011
2714.7G13554993o50940l76816L22189j53579j17264l61939J01853M81491L96805l99857
2724.4G12796936j934891j697769m48608O13403R68247m50364j887664J5640K04849
2733G08179779j166687P67517m4861j539917m42657M01382Q54187J12992r62449j140060
2742.7G05019226L80173l0518j119079M95529N16205j98746p31354k82821J221389
2751.4G05270004P0191j274033p04880K30866J12991n51071K12326j88675j560211
$$ y = [718811569, 720635757, 719660950, 718827820, 718978806, 718123627, 717535477, 718114166, 717612762, 716102753, 717104721, 718372269, 718012238, 719276276, 719422760, 717086945, 716533279, 717315674, 716692200, 715672302, 714360580, 712929153, 713352737, 713300400, 713437881, 714612579, 714132004, 713554993, 712904053, 712527237, 712849426, 712695847, 712578583, 712216644, 712318497, 712799988, 713196793, 712796936, 710862045, 709164276, 708715668, 709329071, 710297318, 709846954, 707959290, 707974930, 708179779, 707013092, 707780609, 707735748, 706195831, 705753174, 706154556, 707008743, 707121735, 706159286, 705019226, 705399399, 705368881, 704249802, 704745331, 705261536, 705062790, 704331436, 704048615, 705270004, 705340195, 704066162, 703361282, 703592148, 703705139, 703154068, 703366394, 703177719, 701617508]
2760G01617508j008530j469803p21511J273498m88357j372605M7531Q23517N21698
2768.7F99222946m20685q80661j242447o53686L08685J203156L59344j292648j14136
2777.4F96489868P58591j11466q84170k67868n87387j384278r384n17807j576690p37839
2787F91171570M75082R84802k28500j626511j875152j554718o82068J130371O61087
2795.7F88455963k56805K84500p80716q70667j01852K50854n03692j220932N80749
2804.4F85837402J070023p27844k326279j973495p25251o44760r23691L74070J245651
2813.1F81205826j021805j457443l56140o67572q29468k1134Q45948n99900j740646
2821.8F75357666j845474j156388l29437n64194m78363o25457M10995j85318r59701
$$ y = [701617508, 700608978, 699139175, 698417664, 699691162, 699202805, 697830200, 697877731, 698701248, 699222946, 698802261, 697921600, 696679153, 696025467, 696334152, 697537308, 697896652, 696604004, 696489868, 697248459, 697136993, 696252823, 695984955, 695397568, 694013290, 694003906, 693486099, 691909409, 691171570, 691646652, 692631454, 692402954, 690776443, 688901291, 687346573, 686664505, 687794876, 688455963, 688199158, 688483658, 687702942, 686832275, 686730423, 686981277, 686477585, 685256653, 685837402, 686907425, 686179581, 683853302, 681879807, 681154556, 680509796, 679586105, 679960175, 681205826, 680184021, 678726578, 678370438, 677702866, 676873398, 676852264, 677698212, 677098312, 675357666, 673512192, 672355804, 672026367, 671462173, 670983810, 670358353, 670769348, 670584030, 669624329]
2830.4F69624329j53k97241m39301k057876q32367J82037k677841k199097j622696
2839.1F59679794j088485p41425j380005o73065j329193j751633j712570j870117j716309
2847.8F47416992k206878k202836j403884j623993j676407j36261l25661n20592J50185
2856.5F37470665m31633r20448q11844K56729N32684N47905N39665j111412k468834
2865.2F33603477j895751m1237o64749j966591o09551k18582j324234j641693j532135
2873.8F23708954q21419R96170J196327j096229k688294j103401L48740k64549L99360
2882.5F20675659m86679j015854J268311L57933j744576j346779n89065j156235o13365
2891.2F15349350l7346p16553R5902j479950k054672k77901k042694j406136O40335
$$ y = [669624329, 669624176, 669326935, 668887634, 666829758, 665997391, 666179428, 663501587, 661302490, 659679794, 658591309, 657849884, 656469879, 655796814, 654467621, 652715988, 651003418, 649133301, 647416992, 645210114, 643007278, 641603394, 639979401, 638302994, 638166733, 637841072, 637320480, 637470665, 637039032, 636118584, 635306740, 635563469, 636096153, 636644058, 637183723, 636072311, 633603477, 631707726, 631666489, 631001740, 629035149, 628425598, 628207016, 626882782, 625241089, 623708954, 622887535, 623883705, 625080032, 623983803, 621295509, 620192108, 620540848, 620276299, 620675659, 620188980, 619173126, 620441437, 620799370, 619054794, 617708015, 617118950, 615962715, 615349350, 615312004, 614595451, 614691353, 613211403, 611156731, 610878830, 608836136, 607430000, 608070335]
2899.9F08070335j368866j466255R29184m21257j828461q90197j173134P7515N86090
2908.6F02514954r54399l47977j67008j367149j123238l99017p60498j357117l217811
2917.2E92820740j772309K100792J06469j196785q37975j748390q73337m69322N19180
2925.9E88649063q0337j319428J456566K650452j63269j484948j223144j096916P38411
2934.6E88126450J147575J037827R84458l65219P31278K84118l67927Q17451Q90770
2943.3E93286781J686211K79388j092300K90718J075516K35748j401443q89168N5084
2952E93526535N86128M18930j724319j829987j042251k41585J302605O52847M9095
2960.6E91697998L32222M47311M28124k90566r3116l20740K48337K178421J763954
$$ y = [608070335, 606701469, 605235214, 606164398, 605743141, 603914680, 603024483, 601851349, 601928864, 602514954, 601560555, 601212578, 601045570, 599678421, 598555183, 598156166, 597395668, 596038551, 592820740, 591048431, 593149223, 593255692, 592058907, 591220932, 589472542, 588599205, 588129883, 588649063, 588568726, 587249298, 588705864, 591356316, 591193047, 589708099, 588484955, 587388039, 588126450, 589274025, 590311852, 591296310, 590931091, 591662369, 591946487, 591578560, 592396011, 593286781, 594972992, 595252380, 594160080, 594450798, 595526314, 595762062, 594360619, 593471451, 593526535, 594112663, 594531593, 592807274, 590977287, 589935036, 589693451, 590996056, 591648903, 591697998, 592030220, 592477531, 592905655, 592615089, 592521973, 592201233, 592449570, 594627991, 596391945]
2969.3E96391945K47612o44570J85242J628723K531281J383514p64389Q83713K139511
2978F03982582K372170J667785J59149J409264L12004J9379J411819P5226l80287K28081
2987.6F11257172J113739J403770J380882R68171O93550Q4610j882401K18353K169457
2996.3F17407303j6976k31628P83501J82838O8512P38068J53427n76553q96492L88679
3006F18000679J251297r45358n76248R57031P96776M42009n63698m91142q15773j151085
3015.6F16904488J14R96018Q72917j031037j834755q85734N18493L19558r46999o1455
3025.2F14851608k62222q9798J77269q49380J66244j733017k994842K90222R76524
3033.9F10532608m16717j134148q98399K06718J232490k8915j520348j084556L0556
$$ y = [596391945, 596639557, 595994987, 596180229, 597808952, 600340233, 601723747, 600959358, 601843071, 603982582, 606354752, 608022537, 608181686, 609590950, 609902954, 609922333, 611334152, 611409378, 611029091, 611257172, 612370911, 613774681, 615155563, 616123734, 616817284, 616901894, 615019493, 615237846, 617407303, 617390327, 617158699, 617942200, 618125038, 618193550, 618931618, 619085045, 618508492, 617612000, 618000679, 619251976, 618306618, 617730370, 618687401, 619484177, 619926186, 619362488, 618871346, 618055573, 616904488, 616904602, 617900620, 618773537, 617742500, 615907745, 615022011, 615540504, 615860062, 614913063, 614851608, 614589386, 614499588, 614676857, 613827477, 613993721, 612260704, 609265862, 609556084, 610532608, 610115891, 608981743, 608083344, 608290062, 609522552, 609493637, 607973289, 606888733, 606919289]
3042.6F06919289P01942j007385j80130Q38203k008705k715454j860695J22376J208114
3051.3F02017555o84585j116219P74536M39110j499824q21152q24127q95043p66296
3060E96623955n88722M21562j395073r84421Q26340J36909j23100l49503j283683j554718
3069.6E91729546K07824p6332p78808p85027j194649K6360m79813N11513J531525j26229
3079.2E90565910q39996j462631q93402m15993K55165J98364j159973j027756j191024
3087.9E84028664p17430K27508J32332n52025j187401j287231n28984J73607j222573
3096.6E79066467o50596J739998R44366j727333k196274j145668j373253j48277O26907
3105.3E75136337m90188j01776J22299M75540n17845k488594j461487j092949n28259
$$ y = [606919289, 607621231, 606613846, 606433716, 607271919, 605263214, 602547760, 600687065, 600809441, 602017555, 601332970, 600216751, 600991287, 601430397, 599930573, 599109421, 598285294, 597390251, 596623955, 596035233, 596456795, 595061722, 594077301, 594903641, 595040550, 594917450, 594567947, 593284264, 591729546, 591937370, 591861038, 591082230, 590297203, 589102554, 589128914, 588649101, 589160614, 590692139, 590565910, 589725914, 588263283, 587369881, 586953888, 587209053, 587407417, 586247444, 585219688, 584028664, 583311234, 583538742, 583671074, 583119049, 581931648, 580644417, 580115433, 580289040, 579066467, 578415871, 580155869, 581100235, 579372902, 577176628, 576030960, 574657707, 574509430, 575136337, 574646149, 574544373, 574666672, 575142212, 574624367, 572135773, 570674286, 569581337, 569053078]
3114E69053078J340370O68030P7438j82953j286354p22465K69050j305580l368759
3122.6E64541855j802941k56805n31998l19900J0185L98789k61612j001816j162949
3131.3E59612808j842651k325440r04159L34205n72471m71039j053352n25284J002769
3140E53255386q77647j583900k381249j775970O89201l13187q80890n37414k68288
3148.7E45326042j218605k585068o35719K51885q43049j277771j353569p31201l96271
3157.4E36536674p33261j367569j298217J04751o4125j417847j325683n19371k13776
3166E29701576n88455p43408j404152p49779P72247O447j384468k901802j547470k87819
3175.7E20872917j370926k53181p15294j062470l03382j242104o42662K41775j246719
$$ y = [569053078, 570393448, 571061478, 571138916, 570955963, 569669609, 568947144, 569216194, 567910614, 564541855, 562738914, 562482109, 561950111, 561630211, 561640396, 562039185, 561777573, 560775757, 559612808, 557770157, 555444717, 554540558, 554874763, 554302292, 553831253, 552777901, 552252617, 553255386, 552377739, 550793839, 548412590, 546636620, 547325821, 547012634, 546131744, 545594330, 545326042, 544107437, 541522369, 540886650, 541138535, 540295486, 539017715, 537664146, 536932945, 536536674, 535803413, 534435844, 533137627, 533242378, 533178253, 531760406, 530434723, 529915352, 529701576, 529113121, 528369713, 526965561, 526215782, 526988029, 526994476, 525610008, 522708206, 521160736, 520872917, 519501991, 519248810, 518533516, 517471046, 517167664, 515925560, 515282898, 515524673, 514277954]
3184.4E14277954k276764j445808j421013N3825K41013j774559o18973l94821j141472
3193E05499382j002617o17561M6692p55768k611885j972466J196060p3051j249580
3201.7D98459206J31950j172256j869812o71235J383515n30167k295341R73777N58854
3210.4D94968491j631623j863937j915665r93538l67088j653023k341804J39045J515236
3219.1D85856094q57544k644043k27928J127587r78775j079789j007690j524200j170121
3227.8D77493591j315422j66931N77278K30904k60620j463318l39317o30608k285614
3236.4D71839943J8082L02467j762734j279220K77367J90124p53708n52139n16434
3245.1D67763748o55975j639252j128006J25122j127815m05655k24533j963234j531410
$$ y = [514277954, 512001190, 510555382, 509134369, 509188194, 509429207, 507654648, 507035675, 506640854, 505499382, 504496765, 503879204, 503925896, 503170128, 500558243, 498585777, 499781837, 499708786, 498459206, 498591156, 497418900, 495549088, 494877853, 496261368, 495731201, 493435860, 494409637, 494968491, 493336868, 491472931, 489557266, 488563728, 488196640, 486543617, 484201813, 484340858, 485856094, 484998550, 482354507, 482126579, 483254166, 482275391, 481195602, 480187912, 478663712, 477493591, 476178169, 476011238, 476588516, 476819420, 476558800, 475095482, 474756165, 474125557, 471839943, 471858025, 472160492, 470397758, 469118538, 469395905, 469586029, 468832321, 468280182, 467763748, 467107773, 465468521, 464340515, 464465637, 463337822, 462932167, 462707634, 460744400, 459212990]
3253.8D59212990O9847M99153K94800J06392j697731j709633k04735m49409j397934
3262.5D54723740j038056J020355R18045j188621k392159j161651J76048J8044m34609
3271.2D50641136k027855j874313K23656J321411k45400r26056J66054l40538l7117
3279.8D46900978j296768j159439P11822o06689j280708j833306o96792J208305k6398
3288.5D41921005p28950m807r23843j728974n08232o99005j562767o92711J992150
3297.2D37063866J589203j404915j577034j669236o22749k10571k6474R22317r53712
3305.9D33110695j511574n91736o03866j606865m74968M75426j122475q38814q8005
3314.6D26747818k6093j535148l65715K97699j700478O23322n33829k233925l50494
$$ y = [459212990, 459282837, 459781990, 460076790, 460183182, 458485451, 456775818, 456571083, 456121674, 454723740, 453685684, 454706039, 455624084, 454435463, 452043304, 450881653, 451057701, 451075745, 450641136, 448613281, 446738968, 446962624, 448284035, 448038635, 447112579, 447278633, 446938095, 446900978, 445604210, 444444771, 445156593, 444549904, 443269196, 441435890, 440739098, 441947403, 441921005, 441192055, 441187248, 440263405, 438534431, 438026199, 437327194, 435764427, 435071716, 437063866, 438653069, 437248154, 435671120, 434001884, 433379135, 433168564, 433142090, 434064407, 433110695, 431599121, 431007385, 430403519, 428796654, 428321686, 428797112, 427674637, 426835823, 426747818, 426721725, 425186577, 424820862, 425118561, 423418083, 424041405, 423507576, 421273651, 420923157]
3323.2D20923157N41572L89214j767197j241226l55988j417579j586724j185455R003
3331.9D14308777j95732j347885n02472J97792P9422O37665k009087j685639J322632
3340.6D10805473j344566j362648m08669k370796k545929o52809Q75244o84242r43756
3349.3D01367302j75972l92036j730690k394639J60103J41182r78546k98920n70297
3357.9C95127487j321945j200714p28569p07436p41882j158791k36396k73438j192780
3366.6C87565536K83318k12746k330322j864586j02920j281357k388992k26059k07062
3375.3C79234810j718102q78830M21067k14997l48968k7123l89366O05049q1787j226959
3384.9C75374794j515427k509346j028328K93694L5439m43001m71688M32167o41975
$$ y = [420923157, 421464729, 421853943, 420086746, 418845520, 418489532, 417071953, 415485229, 414299774, 414308777, 414113045, 412765160, 412262688, 412460480, 412539902, 413177567, 411168480, 409482841, 410805473, 409460907, 408098259, 407689590, 405318794, 402772865, 402120056, 402995300, 402311058, 401367302, 401191330, 400799294, 399068604, 396673965, 396834068, 396975250, 395996704, 395697784, 395127487, 393805542, 392604828, 391876259, 391168823, 390426941, 389268150, 389031754, 388758316, 387565536, 387848854, 387636108, 385305786, 383441200, 383338280, 382056923, 379667931, 379441872, 379234810, 377516708, 376637878, 377058945, 376843948, 376494980, 376467857, 376078491, 376683540, 376601753, 375374794, 373859367, 371350021, 370321693, 370615387, 370650826, 370207825, 369736137, 370168304, 369526329]
3393.6C69526329R4948J822586l69072j802063j533852q68187o5841q45948q87756
3402.3C65071144o18973k95906J353874j11846k157555l22914J8654p42607Q4228L57246
3412C62635345m42466q87413J2741m51660L9215J013031r17092j274566k49863J031876
3421.6C60509148Q95767q03757j061516j029396l72848M58488M63944P6141M52690
3430.3C59588661J68228M04473R53521j006126n4817J102409J369591O27518j925354
3439C61228104n85785M84047J003494q4152l54882J120949n50995q07304j718636J89019
3448.6C59923859J476402M73900K312660J654015O75010m41017k48985Q69789K37961
3457.3C66933594N90019P07931J006203K17133M00009r29337j369705J487808J375695
$$ y = [369526329, 369621277, 371443863, 371074791, 369272728, 367738876, 366870689, 366804848, 365958900, 365071144, 364452171, 364156265, 365510139, 365398293, 363240738, 362917824, 362936478, 362193871, 362278099, 362635345, 362192879, 361305466, 361318207, 360866547, 360905762, 361918793, 361001701, 359727135, 359477272, 360509148, 361404915, 360601158, 359539642, 358510246, 358137398, 358595886, 359059830, 359135971, 359588661, 359756889, 360161362, 361114883, 360108757, 360053940, 361156349, 362525940, 363153458, 361228104, 360642319, 361126366, 362129860, 362045708, 361690826, 362811775, 362260780, 361453476, 359734840, 359923859, 361400261, 361874161, 364186821, 365840836, 366515846, 366074829, 365825844, 366695633, 366933594, 367523613, 368231544, 369237747, 369454880, 369854889, 368925552, 367555847, 369043655, 370419350]
3466C70419350K120819N64689m90455J289367O06080R69543J445656J323356k30636
3474.6C78017769j283150K11487J650734J711807L78113P8125k7466q7700K89192J970673
3484.3C82909584J633339o94389K74086K71034Q52814K028007q2130j715660o40374
3493C84836311J938134L019867J751174L06664j54457q97255m83513J008797K346534
3501.6C93672256K553444N66864J073113N80063k78321J851426K940940J604729j004486
3510.3D03560028l74908O16302O28014J563644K025528J063767N93109R62448k98691
3519D10339241J48582K02370m10385J67465J256295L021888J633492J610565J031418
3527.7D19000931l26157P21932N23376L77312l66936J573525K651443J742706K41051
$$ y = [370419350, 372540169, 373104858, 372614403, 373903770, 374509850, 375479393, 376925049, 378248405, 378017769, 376734619, 376946106, 378596840, 380308647, 380686760, 380764885, 380737419, 380649719, 380938911, 382909584, 384542923, 383848534, 384122620, 384393654, 385246468, 387274475, 387192345, 385476685, 384836311, 386774445, 389794312, 391545486, 391852150, 391697693, 390800438, 390316925, 391325722, 393672256, 396225700, 396792564, 397865677, 398445740, 398167419, 400018845, 402959785, 404564514, 403560028, 403185120, 403801422, 404429436, 405993080, 408018608, 409082375, 409675484, 410637932, 410339241, 410487823, 410690193, 410279808, 410447273, 411703568, 414725456, 416358948, 417969513, 419000931, 418674774, 419396706, 419920082, 420297394, 419930458, 421503983, 424155426, 425898132, 426139183]
3536.4D26139183k477684R2926K283821L107567J928558n4664J018676J566926J376495
3545D34981804J825638L045654M73557o11306J137619K214318J736259k068214K29187
3553.7D42964516K371788K013435N43709l95661K478638J954041J579170J339455J592331
3562.4D56441422P17849L89672L654022M50630J080246K128220J78375J663933R72938
3571.1D67677307J933937L13797O25305J249619J061897K727623J400795K907639K178077
3579.7D82075996P0916K086143L189087J655502M46396L373299J207199k477493j92337
3588.4D91434708J002082M388772L536529K867088J895333R89952K951698P29141K998276
3597.1E12793579L204193j053581K113991L466415L125458K993317O84623N55344J252212
$$ y = [426139183, 423661499, 423754425, 426038246, 429145813, 431074371, 431019707, 432038383, 433605309, 434981804, 436807442, 439853096, 440326653, 439715347, 440852966, 443067284, 444803543, 442735329, 442964516, 445336304, 447349739, 447893448, 447497787, 449976425, 451930466, 453509636, 454849091, 456441422, 457159271, 457548943, 461202965, 461653595, 462733841, 464862061, 465040436, 466704369, 467677307, 469611244, 469925041, 470550346, 471799965, 472861862, 475589485, 476990280, 479897919, 482075996, 482146912, 484233055, 487422142, 489077644, 489524040, 492897339, 494104538, 491627045, 491434708, 492436790, 496825562, 500362091, 503229179, 505124512, 506114464, 509066162, 509795303, 512793579, 515997772, 514944191, 517058182, 520524597, 523650055, 526643372, 527327995, 527883339, 529135551]
3605.8E29135551J462975J523781N415764K537651j439934M850655K643966o28509
3613.5E45501900J796913J037216N603218L420982j831779J595726J542969J225319
3621.2E59892464K942962K382965K117844L614121L041000L522034P003135K096749
3628.9E86613274q152619L268090N373802M063224J969071J376266M533768L367386
3636.6F02412262L81508K06413J412506L732567L888779J128654l39279K15950M297409
3645.3F17336769Q093300K664337O05850N360756l39279l612633j638794L857727L739586
3654F36067619N403328P557602o516037J8311M768142R49326J415329R60159L244629
3662.7F53868408P90711M12597L454209N99060K441864L363952J690827j358948o017914
$$ y = [529135551, 530598526, 532122307, 537538071, 540075722, 538635788, 543486443, 546130409, 545501900, 547298813, 548336029, 553939247, 557360229, 555528450, 557124176, 558667145, 559892464, 562835426, 565218391, 567336235, 570950356, 573991356, 577513390, 584516525, 586613274, 578460655, 581728745, 587102547, 591165771, 593134842, 594511108, 599044876, 602412262, 602793770, 603000183, 604412689, 608145256, 612034035, 613162689, 612823410, 613039360, 617336769, 625430069, 628094406, 628700256, 634061012, 633721733, 630109100, 628470306, 632328033, 636067619, 641470947, 649028549, 642512512, 642530823, 647298965, 648248291, 649663620, 650623779, 653868408, 654659119, 655071716, 658525925, 659124985, 661566849, 664930801, 666621628, 665262680, 659244766]
3671.4F59244766L674469O775818Q920746O688995j5787124k967911O060181N890960
3679.1F78500900j188049o94733M194641K706604j199798k146683J581726N656586
3686.8F87411194N340118r656219k936630Q583831n051269j895142M651947L15094
3694.5F86762924K32849m66919l51257J704025J678009K628327M176025j723556l163453
3703.2F91476974L351212J285324l6850N02548L752594K754364j2049789M106979P769776
3711.9G02913132q058701L388062K649231K94952j202850J368103L644485k336426
3719.6G02659988K34604M841156k23999m000091K864990K294540l72696k357406j389694
3728.3G04551392K137756K170563O889190l305969r452133J0127487K784119j0520554
$$ y = [659244766, 662919235, 669695053, 678615799, 685304794, 669517670, 666549759, 672609940, 678500900, 677312851, 676618118, 680812759, 683519363, 682319565, 680172882, 681754608, 687411194, 692751312, 683095093, 680158463, 688742294, 683691025, 681795883, 686447830, 686762924, 686995773, 686528854, 686177597, 687881622, 689559631, 692187958, 696363983, 694640427, 691476974, 694828186, 696113510, 696076660, 696579208, 700331802, 703086166, 691036377, 695143356, 702913132, 694854431, 698242493, 700891724, 701186676, 699983826, 701351929, 704996414, 702659988, 702894592, 707735748, 707511749, 703511658, 706376648, 708671188, 708298492, 705941086, 704551392, 706689148, 708859711, 715748901, 712442932, 702990799, 713118286, 715902405, 705381851]
3736G05381851m190216P21893L770600K684097K222061l149566J946487J4515686p45468
3744.7G23157425k5824127P580337P756119Q107224M29382j2127152R215927j521911
3752.4G16773224r023209N502396J895599l46756l539047K297211N550003p313919
3760.1G11795502l523026L279495J2894Q50372M174729j822968l777008L221741N916367
3768.8G20128098K919693q194657k589874L068008K167893q46939k144776k96325J75781
3777.4G14386902J735306j199112m630204L428650J772538j454468m8981k505493m8142
3786.1G11436996K770234J105423j41602l02505R98535q6899J93939J192856K808456
3794.8G19975433M770584n648193p943725J563720N773316P910919m889450q771668
$$ y = [705381851, 701191635, 701913528, 705684128, 708368225, 710590286, 707440720, 709387207, 723902893, 723157425, 697333298, 704913635, 712669754, 720776978, 721206360, 709079208, 718295135, 716773224, 707750015, 713252411, 715148010, 714801254, 711262207, 713559418, 719109421, 711795502, 708272476, 711551971, 711564865, 712415237, 716589966, 714766998, 710989990, 714211731, 720128098, 723047791, 714853134, 712263260, 715331268, 717499161, 716652222, 714507446, 714211121, 714386902, 716122208, 714923096, 710292892, 713721542, 715494080, 714039612, 713990631, 711485138, 711436996, 714207230, 715312653, 715171051, 714868546, 715867081, 715780182, 715974121, 717166977, 719975433, 724746017, 719097824, 711154099, 712717819, 718491135, 726402054, 721512604, 712740936]
3802.5G12740936K572556N26886L807754Q510132m945068q717575J262741J129913
3810.2G16888275P42493P25250n20401j940308K985535K533112j1495056K798919M186020
3818.9G16903839L095169n24673j4841843N622711N455323K171936L243255k27051
3826.6G20898666l632354m53949K130279K174912Q83178o593322O2637O874161m221726
3835.3G18122482k219085O503753j2546844l515015J1400528k634430k215729M289399
3843G17185059L051l136978L30506J759414O97632L241882l84750J166992O940689
3851.7G27803497n199279K566909j2650451m143296Q421555k61841j542511J25122
3859.4G15119705J592865M630127l834610j981888O945572l747711r675903N98526
$$ y = [712740936, 715313492, 715840378, 719648132, 728158264, 723213196, 714495621, 715758362, 716888275, 717630768, 718356018, 717835617, 715895309, 718880844, 721413956, 709918900, 712717819, 716903839, 719999008, 719474335, 704632492, 710255203, 715710526, 717882462, 721125717, 720898666, 717266312, 716812363, 718942642, 721117554, 722000732, 715407410, 715470047, 722344208, 718122482, 715903397, 722407150, 709860306, 706345291, 717745819, 715111389, 712895660, 717185059, 717188110, 714051132, 714381638, 716141052, 716838684, 720080566, 719695816, 720862808, 727803497, 722604218, 725171127, 712520676, 708377380, 716798935, 716537094, 714994583, 715119705, 716712570, 721342697, 717508087, 715526199, 722471771, 718724060, 709048157, 709646683]
3867.1G09646683M390945Q511734k901382q704605K229309M237365M110032o424485
3874.8G15095596L9444L218308n27191N99594M206848l153076j0385514M970780K608719
3883.5G16673508K792206O740646j2247543j235810J752091J6174L642502j788635
3891.2G16345139n293351L625641L419571n029449j029740K605362N094452K690506
3898.9G22428131j2520904L299408J642074m456634N991058j391678r72900J287536
3906.7G15306091k00576p04957j458511J239090J732178L17306j462021j343536L02429
3915.3G13727493K251511j071854l662033K872849J166153j998902J357193J436386
3923.1G16078796J797638k063827m083557Q63037J411285J569901k53220j540222J258545
$$ y = [709646683, 714037628, 722549362, 719647980, 710943375, 713172684, 717410049, 721520081, 715095596, 715135040, 718353348, 717826157, 718425751, 722632599, 719479523, 709094009, 714064789, 716673508, 719465714, 726206360, 713958817, 712723007, 714475098, 714491272, 718133774, 716345139, 711051788, 714677429, 718097000, 713067551, 712037811, 714643173, 719737625, 722428131, 709907227, 713206635, 714848709, 710392075, 716383133, 714991455, 714018555, 715306091, 715105515, 714400558, 712942047, 714181137, 715913315, 716230621, 714768600, 713425064, 713727493, 715979004, 714907150, 711245117, 714117966, 715284119, 713285217, 714642410, 716078796, 717876434, 715812607, 711729050, 712592087, 714003372, 715573273, 715320053, 713779831, 715038376]
3931.7G15038376j153412j475983R22699L64914P78198J88447p51725K08741M93621
3940.4G14613876J981507J564254m900054k284928J285629J186905J770859r34982
3948.1G14283066J815643N570m311066J135025J621704j20773j460419m75235J922302
3956.8G14415817k12860j662674n45273K591553R28269l653183j261902J888504P09839
3965.5G13198090K75116J491241K31934j572190j710357J590194R21784k804337n06973
3974.2G11114502J251984J164856k80915o17904L26919K82440j5640K747J698303n84641
3983.8G14342651p57980O15082q60596R92o1340R09881J36185j160355o39953j148682
3993.5G11375885R73892J261902j04294Q5755J88141p34253r21784
$$ y = [715038376, 713884964, 712408981, 713331680, 713696594, 714474792, 714663239, 713911514, 714120255, 714613876, 716595383, 718159637, 713259583, 710974655, 712260284, 713447189, 715218048, 714283066, 716098709, 716104279, 711793213, 712928238, 714549942, 714429169, 712968750, 712493515, 714415817, 714202957, 712540283, 711995010, 714586563, 715514832, 711861649, 710599747, 712488251, 713198090, 713473206, 714964447, 715196381, 713624191, 711913834, 713504028, 714425812, 711621475, 711114502, 712366486, 713531342, 713250427, 712632523, 712959442, 713241882, 713226242, 713228989, 714927292, 714342651, 713584671, 714199753, 713339157, 713340149, 713278809, 714188690, 714324875, 713164520, 712524567, 711375885, 712349777, 713611679, 713507385, 713593140, 713781281, 713047028, 712125244]
4000.2G12125244
$$ y = [712125244]
##END=$$ End of the data block
