##TITLE=$$ Begin of the data block
##JCAMP-DX=5.00 $$ ACD/SpecManager v 10.08
##SPECTROMETER/DATA SYSTEM=Varian
##DATE=07 Jan 2013 10:46:06
##DATA TYPE=INFRARED SPECTRUM
##DATA CLASS=XYDATA
##ORIGIN=
##OWNER=
##NPOINTS=3735
##FIRSTX=399.26403809
##LASTX=4000.35498047
##MAXX=4000.35498047
##MINX=399.26403809
##MAXY=84.96304321
##MINY=17.25071526
##XFACTOR=1.0000000000
##YFACTOR=0.000000100000000
##FIRSTY=82.80446625
##DELTAX=0.96440572
##XUNITS=1/CM
##YUNITS=TRANSMITTANCE
##XYDATA=(X++(Y..Y))
399.3H28044662N48020K1037750j63300934L2720185m9317246j15612182j7242814
406E36877441p8838996O1970901J7639847m6741905Q7625808j9262275k8136254j4891700
413.7E16242867j4283066K574997l8827019n9592857K1298790J54863815N8512649
420.5F40790176m0939750k6238556O1532135l1906891k4008827M5070686M2054939
427.2F66353912K1423798j35575943j16743317k3549423N1484642M6717644m9713211
434D60398102J3192825P0806427O4858627P6694718m9551010j08293228j8068886K521629
441.7E12559204k2881393m361840q409996J9275017P0495529L5120354l2733116o553650
449.4E62510109m3194237l7091827M2414665N6190033L1702499k6683502J3598290
$$ plain form
399.3 828044662 828592682 849630432 686329498 719049683 669732437 554120255 536877441
406 536877441 458038445 520009346 537649193 490907288 578533096 559270821 531134567 516242867
413.7 516242867 501959801 504534798 465707779 406114922 427413712 582277527 640790176
420.5 640790176 599850426 573611870 635144005 603237114 579228287 624298973 666353912
427.2 666353912 687777710 552201767 435458450 411909027 463393669 510111313 460398102
434 460398102 473590927 544397354 609255981 685950699 636399689 528106461 510037575 512559204
441.7 512559204 489677811 485315971 476905975 496180992 566676521 601796875 569063759 562510109
449.4 562510109 519315872 482224045 524638710 580828743 612531242 585847740 599446030
456.2E99446030K1875229j10259095J5245476J6419373j8555527o673584O4526939
462.9E82024841N3862725n0427628m3525848m5604859k3376617L2997131J36426430
469.7F42376175M4349670r8863525j7876587O5914993n989303j12048149p6344071
476.4D41519203j135635l176003J2236862J1675339P9397202O989555q6412811J1049766
484.1D72143478P9292412J2796440k8245010k5905037k4462051L4307365J3375206
490.9E33302803k2349472p988205K5862846P5897675l2983818k4569779j1190261k4117852
498.6E11863937M5792580l6962929n4124374K205772L9351769J6307831j9138184M6155052
506.3E51451454M4438973l2398835j6472587K079925m6140022k753906N3773269j6191635
$$ plain form
456.2 599446030 621321259 511062164 526307640 542727013 524171486 517497902 582024841
462.9 582024841 635887566 585459938 541934090 496329231 472952614 505949745 642376175
469.7 642376175 686725845 587862320 569985733 635900726 629911423 517863274 441519203
476.4 441519203 440383568 437207565 449444427 461119766 540516968 547506523 461093712 472143478
484.1 472143478 551435890 564232330 535987320 510082283 485620232 519927597 533302803
490.9 533302803 510953331 502965126 528827972 604725647 571741829 547172050 535981789 511863937
498.6 511863937 557656517 520693588 466569214 468774986 508126755 524434586 505296402 551451454
506.3 551451454 595890427 563491592 547019005 549098930 502958908 500205002 553978271 537786636
514E37786636l4592170Q38012K5562401n491714k3937798r641228O847153J8768234
521.7E16139526j6804046M378128L2008972K0519524j0574608k8761330j0542679j800613
529.5E04562874L7438164J3913841l8714409k3481369J3420029L4089737m633599j4442634
537.2E22152634o58417m933739m228096K465897N441856k5614776j6091805M622841
544.9D83156395p346039J8036957M5964737Q124542k2568970n208130J408844J2453805
552.6E34022141J1951522j8146324k1969642J2388801L8176804j133499k7773934j307869
560.3E26208000P193337Q681335O800346j3723945j7464905k9983J2757873M162788
568E34584846m993438O553268j161651r997750j405105P975425Q449555k1396523j5224113
$$ plain form
514 537786636 503194466 504032478 529594879 524103165 500165367 490524139 497371292 516139526
521.7 516139526 499335480 503713608 535722580 556242104 545667496 516906166 506363487 504562874
529.5 504562874 542001038 555914879 517200470 493719101 507139130 541228867 536595268 522152634
537.2 522152634 521494217 516560478 512332382 514798279 520240135 494625359 478533554 483156395
544.9 483156395 475810356 493847313 539812050 547936592 525367622 520159492 521568336 534022141
552.6 534022141 545973663 527827339 505857697 518246498 556423302 555289803 527515869 526208000
560.3 526208000 533401337 542082672 548883018 535159073 517694168 517664185 530422058 534584846
568 534584846 529591408 536144676 534983025 524985275 523580170 531555595 540005150 518608627 503384514
576.7E03384514J2635269n951271j1542473J9768334J0641670p133293J8221550J426353
584.4E41450653r846611M842987K954216j609993j8494339L319473m833145k1931953
592.1D95851288K1537475J3744851j4020386k562409J8735161n31311j8051414L402672
599.9E18105927L197059p650337n049133j909447m983368l253784n830231j862030
607.6D90764656J961594j4856682r343033r703331j1433639p767983j4506493j2371368
615.3D12743721r359245K066192L969117J3322219P907982j6858139j1432953j3155937
623C89202957m393005N204811J557350K1388016L0278168J9326095j380310n28793
630.7D60655289J1193733j0284081j414108J3130417j4301987j5582390k324714k059517
$$ plain form
576.7 503384514 516019783 510068512 498526039 518294373 528936043 521802750 540024300 541450653
584.4 541450653 531604042 536447029 539401245 537791252 519296913 522616386 517783241 495851288
592.1 495851288 517388763 531133614 517113228 514550819 533285980 532754669 514703255 518105927
599.9 518105927 521302986 513652649 508603516 506694069 501710701 498456917 492626686 490764656
607.6 490764656 492726250 477869568 468526535 458823204 447389565 439621582 425115089 412743721
615.3 412743721 403384476 405450668 409419785 422742004 430649986 413791847 402358894 389202957
623 389202957 384809952 390014763 391572113 412960129 443238297 462564392 461184082 460655289
630.7 460655289 471849022 461564941 460150833 473281250 458979263 443396873 441072159 439012642
638.4D39012642l971634K497787J0728608O244125J4216156J3251076J9716949K8095474
646.2E29791183N490723J058312J2311554J3172912m847145j3784714m739265J229820
653.9E39683380P709427N69725L968582Q849869m40102n821952j41259J2262345M802208
662.5E71442223k154236M81987J5858192J4574700l2947083o9629974K5492897K3880768
670.3E46999474J7987060l356056L297005J0951423J890717L441314K740403m16947
678E83534393N625725j141777o559105N690727P67365n761490n400658K180367J1110496
686.7E90046043O741715l627625j8128051r255410m6119p936516K956886J4365311
694.4E75116234o267204k3458100j107101J4455185P866707o681939j1228141J1416893
$$ plain form
638.4 439012642 435041008 437538795 448267403 454511528 468727684 481978760 501695709 529791183
646.2 529791183 535281906 536340218 548651772 561824684 556977539 543192825 538453560 539683380
653.9 539683380 547392807 547962532 551931114 560780983 560340881 554518929 554377670 566640015 571442223
662.5 571442223 569287987 569769974 585628166 600202866 567255783 497625809 523118706 546999474
670.3 546999474 564986534 561630478 564927483 575878906 577769623 581210937 583951340 583534393
678 583534393 589160118 588018341 581459236 587149963 587917328 582155838 576755180 578935547 590046043
686.7 590046043 596787758 593160133 575032082 565776672 565730553 557794037 560750923 575116234
694.4 575116234 568849030 545390930 544283829 558739014 566605721 559923782 548695641 560112534
702.1E60112534R988632j2444153j0395393N216445N984688o030388L004113J4603805
709.8E70040283J390801l515396K961578o69632K60773K906150Q90694M816628Q271904
718.5E87353783M865684J417847j921387r880981k098580Q838997L493538L874779
726.2E95943680p04766q438110m024200J879921L639068M08936m791603k664528M668770
734.9E85917168k081032k411919P354431M226876j912155j498909L770256j092949
742.6E92271767m909325l514633j226158L914222P6333N956497Q269539L210067O499710
751.3F10548019k40058q83294O873436L271828o21529L607827J058311q76808M533272
760F27271004L292427k411690n454521M847183O869774k175407k754136k210464L583717
$$ plain form
702.1 560112534 570101166 557657013 547261620 552478065 558462753 552432365 555436478 570040283
709.8 570040283 571431084 567915688 570877266 570207634 570468407 573374557 574265251 579081879 587353783
718.5 587353783 592219467 593637314 591715927 581834946 579736366 588575363 592068901 595943680
726.2 595943680 595238914 586800804 582776604 584656525 588295593 588704529 583912926 581248398 585917168
734.9 585917168 583836136 581424217 588778648 593005524 591093369 589594460 593364716 592271767
742.6 592271767 587362442 583847809 582621651 586535873 586612206 592568703 600838242 604048309 610548019
751.3 610548019 610307961 609424667 616298103 619569931 618948402 622556229 623614540 622737732 627271004
760 627271004 630563431 628151741 622697220 627544403 634414177 632238770 629484634 627274170 630857887
768.6F30857887L599434K178040p164269j0440101M415512m811402m942550J4607620
776.4F28300171J5715103l455505j5417443N281449J4885063M178009M585342R196701
784.1F63268890K719651q358002q170624p239837j414872P693405Q346863M540406
791.8F61385880K763366J369553r224625m920196R425659M722671o903457j0275650
799.5F48343201n020142P010651J0381851M309692M175721p459794o636352J4512863
807.2F69617691O398087l070908j427536p866287m890290R58863k633057r625473n674133
815.9F41786957N158539P765045K718582Q039398P182541j5914688l671417J1489029
823.6F64553986j0138855o232071N548248P916260L480224r595565r20182J675492
$$ plain form
768.6 630857887 634457321 636635361 629471092 619030991 623446503 618635101 613692551 628300171
776.4 628300171 644015274 640559769 625142326 630423775 645308838 649486847 654072189 663268890
784.1 663268890 665988541 657630539 649459915 642220078 640805206 648498611 656845474 661385880
791.8 661385880 664149246 665518799 656294174 651373978 660799637 665522308 658618851 648343201
799.5 648343201 643323059 650333710 660715561 665025253 669200974 661741180 655104828 669617691
807.2 669617691 676015778 672944870 671517334 663651047 658760757 659719620 657086563 647461090 641786957
815.9 641786957 646945496 654710541 657429123 665468521 672651062 656736374 653064957 664553986
823.6 664553986 654415131 648183060 653731308 661647568 665127792 655532227 654612045 656287537
831.3F56287537j1006470r840241n239639m635048r81865J351548m600907n038681
839F16296234p159996o623688k67982n975762l208580M153824K996941k502632q282013
847.7E89426346n323067J299362O051865O251297O985893j612358r222794L886300
855.4E97742844J2525291Q671303J920280J326447M241371N597725J0188713J546707
863.1F43760681p967186N37605P253571L725891K467575M687195j539230o676941l809662
871.8F42439499J626358O660767O283874M225769J300736n803071j3102188o016845
879.5F37614899N326538j508255r546356k992974N551148K866287k861939K859536
887.3F37308884K943115o491737l603783J847572m68635l077240m139634N54390K897416
$$ plain form
831.3 656287537 645281067 635440826 630201187 625566139 624584274 625935822 621334915 616296234
839 616296234 609136238 602512550 602244568 596268806 593060226 597214050 600210991 597708359 589426346
847.7 589426346 584103279 585402641 591454506 597705803 604691696 603079338 593856544 597742844
855.4 597742844 610268135 618939438 620859718 622186165 626427536 632025261 642213974 643760681
863.1 643760681 635793495 636331100 643584671 647310562 649778137 654465332 652926102 646249161 642439499
871.8 642439499 644065857 650726624 657010498 661236267 662537003 656733932 643631744 637614899
879.5 637614899 642941437 641433182 631886826 628893852 634445000 637311287 634449348 637308884
887.3 637308884 640251999 633760262 630156479 632004051 631535416 628458176 624318542 624872932 627770348
895.9F27770348j68763P28569J96991j213035K564316L634109j245117l159676j606064
904.6F27501678j877594j737861J07422k526932n508080L55072k321281j0970917n354919
913.3E97666588O08558m72908m642257n344277j564521m993058m872093K569618j576614
922E77379036j0381126l810730L863372k693290l028756J286850m883918m630623M0092
930.7E53140907J843453M416122j100197m358215J417618O055717Q692436Q561135
938.4E78668976L501320n216103m136734Q875694O484490N7564R697189J0226860M586372
947.1F12745628o82373o237068L171272P900162J559868K993736L784142m83895N32876
955.7F25284348J45225n886841p256965m498864J681099K619477p311058o112938j875115
$$ plain form
895.9 627770348 627601585 628330154 628527145 627314110 629878426 633512535 632267418 629107742 627501678
904.6 627501678 625624084 623886223 623993645 621466713 615958633 616313705 613992424 603021507 597666588
913.3 597666588 598275146 597802238 593159981 587815704 586251183 581258125 576386032 578955650 577379036
922 577379036 566997910 563187180 567050552 564357262 561328506 562615356 557731438 553100815 553140907
930.7 553140907 554984360 559400482 558300285 553942070 555359688 561415405 570107841 578668976
938.4 578668976 582170296 576954193 572817459 581693153 588177643 588235207 597932396 608159256 612745628
947.1 612745628 612063255 605826187 608997459 616897621 618457489 621451225 625235367 624751472 625284348
955.7 625284348 625429573 619542732 612285767 607786903 609468002 612087479 604776421 598663483 596788368
964.4E96788368n064163l725319m288101j231575M025612k11792n341187o364364j398774
973.1E73188705M286995q239n301934J57395N070724j530685l865166o1684j845245
981.8E70090866n81894J753235q93860l254623k052803j193047l478317m680863o273994
990.5E49434700l873901l998299n995255o126022j6496239j5456924j810265J0353966
998.2E06031761J6190415M081535k403603J623879J737938k488518j623764O47736
1005.9E23797379r7657p38144m969215K849579O90842p375222l45077O32667J695900
1014.6E16141052n411949p043457r65424k299652R7199l061295l479690l112412m343567
1023.2D86520805m877510n48095M511756n426063o721878m069557j696587J941147
$$ plain form
964.4 596788368 591724205 587998886 583710785 582479210 586504822 586293030 580951843 574587479 573188705
973.1 573188705 577475700 577467461 572165527 572322922 577393646 575862961 571997795 571936111 570090866
981.8 570090866 569508972 571262207 570368347 567113724 565060921 563867874 560389557 555708694 549434700
990.5 549434700 545560799 541562500 535567245 529441223 512944984 497488060 495677795 506031761
998.2 506031761 522222176 526303711 523900108 525523987 527261925 524773407 523149643 523797379
1005.9 523797379 523699722 522961578 517992363 520841942 521532784 514157562 513812485 514445152 516141052
1014.6 516141052 510729103 503685646 502720222 500420570 500517769 497456474 493976784 490864372 486520805
1023.2 486520805 481643295 481095200 485606956 480180893 473459015 469389458 467692871 469634018
1031D69634018m113083p473869o655503l432273K986946Q229789p09686n937500J263962
1039.6D53792801K585487Q99620k391243l401298l127289L23830l878746n410157N299034
1048.3D44692039N069848R00879l870087J586723L906937N58700N504570L65067k313919
1057D56400757n622292m005737M521446L453484j526528l402862q21304n894509l426208
1065.7D39676247K929535L479538J82724m684830j149712j051826O43921j79978L767624
1074.4D43613243J088219j0393753j667938J3389L061180N717125m56924j343956m511986
1083D35118599k074127k072182M510155P684326n623512o118775k493782n053596m112702
1091.7D19764404m890403o015625m514237r173775q405494o194954j1083870j0541420
$$ plain form
1031 469634018 465520935 458047066 451391563 447959290 450946236 459176025 458466339 452528839 453792801
1039.6 453792801 456378288 457277908 454886665 451485367 448358078 448681908 444803162 439393005 444692039
1048.3 444692039 449761887 450662766 446792679 448379402 452286339 452845039 458349609 458714676 456400757
1057 456400757 450778465 446772728 451294174 454747658 453221130 449818268 448996964 443102455 439676247
1065.7 439676247 442605782 446085320 446268044 441583214 440433502 439381676 440025597 439845619 443613243
1074.4 443613243 444701462 434307709 432639771 432653160 435714340 441431465 440974541 439630585 435118599
1083 435118599 433044472 430972290 435482445 443166771 437543259 431424484 428930702 423877106 419764404
1091.7 419764404 414874001 408858376 404344139 395170364 386764870 380569916 369486046 358944626
1099.4C58944626q553200q446350j1583290q973580r844932j3848763j2344875j4351597
1107.1B70998039p619095k763576n449391r834632r663029n008087l030834n709973
1114.9B21919422p688579Q49647k382755m049149J829205M074745M131107m80270K159920
1123.5B20363293O24122J185055N01385K284527O260032j045837m989090q558350J450157
1132.2B18075294O378060l07617n654068p408314M003830O2714o618557r566613n391750
1140.9A93572979R65595m934501j883984l974953l706207j886711j688404m01058k513199
1149.6A73549557K405205J584033k242889k788753L897209K152099M74663R148750
1157.3A88179874M581776K73419k450390J136665O530437M122715N512009N256901
$$ plain form
1099.4 358944626 350391426 341945076 330361786 321388206 311543274 297694511 285349636 270998039
1107.1 270998039 263378944 260615368 255165977 245331345 235668316 230660229 227629395 221919422
1114.9 221919422 214230843 215080490 212697735 208648586 210477791 214552536 218683643 218203373 220363293
1123.5 220363293 220987415 222172470 222673855 224958382 231218414 230172577 225183487 216625137 218075294
1132.2 218075294 224453354 224145737 218491669 211083355 215087185 215149899 208531342 198964729 193572979
1140.9 193572979 194538574 189604073 187720089 183745136 180038929 178152218 176463814 176062756 173549557
1149.6 173549557 175954762 177538795 175295906 172507153 176404362 178556461 179031124 188179874
1157.3 188179874 192761650 193035069 190584679 191721344 198251781 202374496 207886505 213143406
1165B13143406K710495L329887N782166K569752O412658J0291081O965408Q431301
1172.7B59636154Q785725P940159N184593P505436P563419N631600J0421047J0608005
1180.4C23276138P855492P572861Q858146O102181O099205P134514O904030P625198
1188.1C81427765L798599K964935K545128M752693O547127N612870N751533L386269
1195.9D16786919N303421O661682N503311K168999K737541O887970N546722M319191
1203.6D55915756J320534J362648K250900L138237L227196P62177N089149M311295
1211.3D77377892J200256M2038o14624J673584J987228L338814P84416M90914K309722
1220D88590240J631890J437034j788902j070633j45225j169548p93267P99370J233292
$$ plain form
1165 213143406 215853901 219183788 224965954 227535706 233948364 244239445 251204853 259636154
1172.7 259636154 268421879 276362038 281546631 289052067 296615486 302247086 312668133 323276138
1180.4 323276138 331131630 338704491 347562637 353664818 359764023 366898537 373802567 381427765
1188.1 381427765 385226364 388191299 390736427 395489120 402036247 407649117 413400650 416786919
1195.9 416786919 422090340 428752022 434255333 436424332 439161873 446049843 451596565 455915756
1203.6 455915756 457236290 458598938 460849838 463988075 467215271 467977448 473066597 477377892
1211.3 477377892 478578148 478620186 478005562 479679146 481666374 485005188 485789604 486280518 488590240
1220 488590240 490222130 491659164 489870262 488799629 488654404 487484856 486691589 487490959 488724251
1228.6D88724251l04604J199265r01222k042046J609611J436539k313537k316208K745857
1237.3D87837906L829307P91321j56593K407837K958488J558342o4850o27479J443481
1246D99977760j43928l24364J423874M16908j524772j402283O20880R91135K373504
1254.7E02408714l34129O19316L606720q23402l97873m73366m28276n65376k163086
1263.4E01449242L247490K882156j203995L29323J558762K13966p58324J161499L634796
1272E12514915K222596l4409L420143N273514J934242N58243Q68340J253471K516365
1280.7E30527420L285027N82542k98996K630234L508873M138870K954559J697274K644653
1289.4E51670456J435394Q29621N91049K588463L751487J546631K345810L011437L682479
$$ plain form
1228.6 488724251 488419647 489618912 488717690 486675644 488285255 489721794 487408257 485092049 487837906
1237.3 487837906 491667213 492458534 492301941 494709778 497668266 499226608 499161758 498534279 499977760
1246 499977760 499833832 499509468 500933342 501350250 499825478 498423195 499044075 500035210 502408714
1254.7 502408714 502074585 502693901 506300621 505477219 505079346 504605980 504177704 503612328 501449242
1263.4 501449242 504696732 507578888 506374893 506704216 508262978 508476944 507718620 508880119 512514915
1272 512514915 514737511 514703102 518123245 523396759 525331001 525889244 526757584 528011055 530527420
1280.7 530527420 533812447 534394989 534095993 536726227 540235100 544373970 547328529 549025803 551670456
1289.4 551670456 553105850 553935471 554526520 557114983 560866470 562413101 564758911 567770348 571452827
1298.1E71452827K314034j376076j421661j87493J147957K734108L727112M517555
1305.8E82908363L171692o12297L34397N87577j126442K922020k88238m147263L44849
1314.5E84094658K989540L459435J430969J531791R73206J80092Q37860n27191l71552
1323.2E94598808j64909J770515Q13408j33476L283005J906166N20935j175613l857461
1331.8E97561378k071189K410316N774536J857262j152649R05609j283913l933487
1339.6F00067863j521606L595238K646980k350960j457481k46391n93720J072121J082763
1348.2F02294807R85413q21419j788444j436577j285668J950379J319771k635460j843147
1356.9E96739655N45272J903992N55534j194839P55844M29726k876740J39618J16692
$$ plain form
1298.1 571452827 573766861 572390785 570969124 570781631 571929588 574663696 578390808 582908363
1305.8 582908363 586080055 585467758 585802155 586389732 585263290 588185310 587897072 583749809 584094658
1314.5 584094658 587084198 590543633 591974602 593506393 594479599 594659691 595497551 594970360 594598808
1323.2 594598808 594433899 596204414 597017822 596884346 600167351 602073517 602594452 601418839 597561378
1331.8 597561378 595490189 597900505 603675041 605532303 604379654 605285263 604001350 600067863
1339.6 600067863 598546257 602141495 604788475 602437515 600980034 600733643 600139923 601212044 602294807
1348.2 602294807 603280220 602458801 600670357 599233780 597948112 599898491 601218262 598582802 596739655
1356.9 596739655 597284927 599188919 599744453 598549614 599305458 599735184 596858444 596998062 597114754
1365.6E97114754j894074q92372j942634j417885K439422J533280k390709j700707
1373.3E90849075K63634j774292k695427j384315J289062K322197K556877L58963l558120
1382E88227654j488534j63955k260933k246018K61040J284866o9236K965965K317734
1390.7E88828583j312714j291313O89163K127533r42383L01895m91752j644020j32218
1399.3E86132774j247863K81295l09791k411919l060341j371956J646614P58782J580429
1408E81998024o52428k214775J356163J919632j156578k084350M5051j183243m269752
1416.7E73757744j005135M589424L537026l057785P07435K784348k4185k350693J571121
1425.4E80509300J207352j268044j9950J656646K254944J032333J599045J382103o141
$$ plain form
1365.6 597114754 595220680 594328308 592385674 590967789 593407211 594940491 592549782 590849075
1373.3 590849075 591112709 589338417 586642990 585258675 586547737 588869934 591426811 591785774 588227654
1382 588227654 586739120 586575165 584314232 582068214 582329254 583614120 583544884 586510849 588828583
1390.7 588828583 587515869 586224556 586913719 589041252 588098869 588400764 587909012 586264992 586132774
1399.3 586132774 584884911 585166206 584856415 582444496 579384155 578012199 579658813 580417595 581998024
1408 581998024 581345596 579130821 580486984 582406616 581250038 579165688 579210739 578027496 573757744
1416.7 573757744 572752609 577342033 580879059 577821274 578528709 581313057 581288872 578938179 580509300
1425.4 580509300 581716652 580448608 580428658 582085304 584340248 585372581 586971626 588353729 588347588
1434.1E88347588J400871M17366q600769Q60023O599503K140541O66962K551002M97475
1442.7E94880562o68526O04172L480644K688751k97393l263779l043938N2262L648338
1451.4E98081093L671760k694358j641884K227134l46870R55048N504570J524925l384743
1460.1F03896675n57136L315010L201332L236732K363396n68810Q18253K269859J218529
1468.8F19193840k13165m51851p79381N110359O621514J801071o87790K014198N180588
1477.5F37789383o2256L68729K416000l92837k60087O29731K443924L510284j2970
1486.1F46429901r78241J135712q48770p743340l426323L731995l11661k047310K395439
1494.8F38337402O249848R14230m720611o246415n64880L021049m87327k169609l034897
$$ plain form
1434.1 588347588 589748459 590165825 581565056 582425079 589024582 591165123 591832085 594383087 594880562
1442.7 594880562 594212036 594816208 598296852 600985603 600688210 597424431 594380493 594432755 598081093
1451.4 598081093 601752853 599058495 597416611 599643745 599296875 600251923 605756493 607281418 603896675
1460.1 603896675 603339539 606654549 609855881 613092613 615456009 614887199 615705452 617975311 619193840
1468.8 619193840 618980675 618528824 617749443 622859802 629481316 631282387 630594597 632608795 637789383
1477.5 637789383 637727127 638095856 640511856 640119019 639858932 640488663 642932587 646442871 646429901
1486.1 646429901 645451660 646587372 645738602 637995262 634568939 638300934 637989273 635941963 638337402
1494.8 638337402 644587250 645501480 640780869 634534454 633969574 636990623 636503296 634333687 631298790
1503.5F31298790j675034j889114j840210o190453n440368J029777k9640K10838l782653
1512.2F11691933j780434Q74138l517037j511001j418457j270523K118606K376023
1519.9F07563248m22478o660919j094933J135559j96647k230263J238670J177101r39865
1528.6E99569473q03184j166344j628914j193275j781159k567444J195450M51088R690
1537.2E92085381j123238r113388m70505P269135P254104m779777m079438k48756l815346
1545.9E82978172R48258J830787J059914M73671j1597K204399L059578K465401k375526
1554.6E92633057j89476K163696L477440J8004913j1132622j8151855Q375511O279297
1562.3F01459961J879616o21643Q33587J466675n45578N9090j098252m422912N424652
$$ plain form
1503.5 631298790 629623756 627734642 625894432 619703979 614263611 615293388 615263748 615474586 611691933
1512.2 611691933 609911499 610785637 607268600 605757599 604339142 603068619 605187225 607563248
1519.9 607563248 607140770 600479851 599384918 600520477 600323830 598093567 599332237 600509338 599569473
1528.6 599569473 598766289 597599945 595971031 594777756 592996597 590429153 591624603 592075691 592085381
1537.2 592085381 590962143 581848755 581378250 588647385 595901489 591121712 587042274 586793518 582978172
1545.9 582978172 583926430 585757217 586817131 587290802 587279205 589483604 592543182 595008583 592633057
1554.6 592633057 592443581 594607277 598084717 616089630 604957008 586805153 595180664 601459961
1562.3 601459961 603339577 602717934 603551521 605018196 604472618 604531708 603433456 599010544 604435196
1571F04435196K536430j648330j434136l27034K390747m81872l9559j197052l100624
1579.7F01133766k202949j285897J035729q94966q79593m53949k260781m817314m075889
1588.4E85298157Q56094k039871l178177k356682j036720J44348k523117k064247l858452
1597E69241333o521835m787064o11916k058677k224388j663323l750419j611214k007980
1605.7E44004517k476616m572373l551826k831650j626778q61969l365860l81279k399101
1614.4E21937065j030426k661667p492599M14810m423523l17268o68869j665726l469925
1623.1E00621872m804230J533814o85044M0245n455474m241257m32625j99394j908989
1631.7D84468918l994637J478043J777267L917923p138939k526435J173400j212654
$$ plain form
1571 604435196 606971626 605323296 603889160 603562126 605952873 605471001 605431442 604234390 601133766
1579.7 601133766 598930817 597644920 598680649 597785683 596906090 596452141 594191360 589374046 585298157
1588.4 585298157 586154251 584114380 580936203 578579521 577542801 577687149 575164032 573099785 569241333
1597 569241333 562719498 557932434 557320518 555261841 553037453 551374130 547623711 546012497 544004517
1605.7 544004517 541527901 536955528 533403702 530572052 528945274 528083305 524717445 524336166 521937065
1614.4 521937065 520906639 518244972 510752373 511167183 506743660 506426392 505757523 504091797 500621872
1623.1 500621872 495817642 497351456 496666412 496706657 491251183 487009926 486577301 486377907 484468918
1631.7 484468918 480474281 481952324 483729591 487647514 480508575 477982140 479155540 477942886
1639.5D77942886N13573j503296k6703j25618j9302l82080P20978L205947k498779
1648.1D77827606K769432Q52661L271714O414833j781578r564476N433960K397117
1655.9D87621269j158104J985894K585639K456551J049309K32391J105042N17273N845298
1664.5E02240562L022080R77936N72281K146034M806976J994476M890786R12590L588104
1673.2E25151825M261513O07910l066521O63033N281486N458298O308136O33964J729012
1681.9E47028656Q303185Q212394n321159l040466M482765K833442L713761N105324
1689.6E71317902K533531L417167L380585K797394J890717L810577N495758M934349
1697.3E99577980N049324K942772L092232M518318O257896N546837M187737K279472
$$ plain form
1639.5 477942886 478456459 476953163 476926460 476800842 476781540 476399460 477120438 480326385 477827606
1648.1 477827606 480597038 481449699 484721413 491136246 489354668 479790192 485224152 487621269
1655.9 487621269 486463165 488449059 491034698 493491249 494540558 494772949 495877991 496395264 502240562
1664.5 502240562 505262642 506240578 506812859 508958893 513765869 515760345 520651131 521563721 525151825
1673.2 525151825 529413338 530021248 526954727 527617760 532899246 538357544 544665680 545299644 547028656
1681.9 547028656 555331841 563544235 558223076 555182610 559665375 562498817 566212578 571317902
1689.6 571317902 573851433 577268600 580649185 583446579 585337296 589147873 594643631 599577980
1697.3 599577980 604627304 607570076 610662308 615180626 621438522 626985359 631173096 633452568
1705F33452568M612007K339020j98441L924942K489090J976853K815475M649735O020660
1713.7F62081909j216278J287689N585633K093277n620728J420288N560684K338181
1721.4F73530655J806488K647934R41009L82538J92566Q01773K59552Q84552l26462
1730.1F81120605J895066N322189L728256j286392r876861M797287N702362J184463
1737.8F92586975K081833j065445r14154L743362K219849L491440J848907R37882J235885
1746.5G06166534P49894J705398J770783M690475K132721k455673L029404L804931
1754.2G21594467L230362K950821j048965K98004L479843J343994o36292l45916L924103
1762.9G34790421M384155J296921j261139P22427L095322k78015J220245J716690k273407
$$ plain form
1705 633452568 638064575 640403595 640205154 644130096 646619186 648596039 651411514 656061249 662081909
1713.7 662081909 660865631 662153320 667738953 669832230 664211502 665631790 671192474 673530655
1721.4 673530655 675337143 677985077 678926086 679308624 679501190 680302963 680562515 681447067 681120605
1730.1 681120605 683015671 688337860 692066116 690779724 680902863 685700150 691402512 692586975
1737.8 692586975 694668808 693603363 692689209 696432571 698652420 702143860 703992767 704930649 706166534
1746.5 706166534 706916428 708621826 710392609 715083084 717215805 714760132 717789536 721594467
1754.2 721594467 724824829 727775650 726726685 727024689 730504532 731848526 731212234 730866318 734790421
1762.9 734790421 739174576 740471497 739210358 739932785 743028107 742750092 743970337 745687027 743413620
1771.6G43413620m216919j669311O062850L981858j832123Q55255J865463K02103j693497
1780.3G46969299q45718n0507J476059N057602L086624l230819k736588J550980J959533
1788.9G53236465K77024P19986J720886k288284l146668J825180J613465J127395K042008
1797.6G57127457Q97445k024078O42090K590484l597106r19571M794311L225784j763305
1806.3G60973511l012772M5777J861801Q52203l765335L10211L344040j31073o6071
1815G60412292K95411M59060q14285N20477K533036P57141R21707M31442L4866L21503
1824.6G65872650l077011k040634K660522L120880J21308J64947J442566J059952r62143
1833.3G68363037j521988j056518j201706j194535J333771L575821J55945k50855J076661
$$ plain form
1771.6 743413620 739196701 737527390 743590240 747572098 745739975 746595230 748460693 748662796 746969299
1780.3 746969299 746123581 746073074 747549133 752606735 755693359 752462540 749725952 751276932 753236465
1788.9 753236465 753513489 754233475 755954361 753666077 750519409 752344589 753958054 755085449 757127457
1797.6 757127457 758024902 756000824 756642914 759233398 755636292 754716721 759511032 762736816 760973511
1806.3 760973511 757960739 758006516 759868317 760720520 756955185 757265396 760609436 760478363 760412292
1815 760412292 760707703 761166763 760352478 760872955 763405991 764163132 765084839 765516281 765551147 765872650
1824.6 765872650 762795639 760755005 763415527 766536407 766657715 766822662 768265228 769325180 768363037
1833.3 768363037 766841049 765784531 764582825 763388290 764722061 768297882 768453827 768202972 769279633
1842G69279633J223220J58616n025101K194214J402359j440659J268082P76443N46875
1850.7G70383682n01404n33676J780014P96891r90601l74298L63083k31400o81534
1859.3G70010757L7766L35007J06277J834717R76028r94796p70646j121139R87625
1868G71401596J674805j269379J36108J335907p78198J13983K214814N493j483002
1876.7G73352127j367645J716919J457062j597748J079788J913986j65100k161331
1884.4G74228058j824646q51746J94245K629547Q33435j752396j983261j695938J72729
1893.1G69950027K418061K506027K83279N67856j86081q22830n08728q78448j28403
1901.8G73200760N75409j76621p00378K288742R67712j367187K54593j511765o99539
$$ plain form
1842 769279633 770502853 770661469 765636368 767830582 769232941 767792282 769060364 769836807 770383682
1850.7 770383682 769882278 769348602 771128616 771925507 770934906 770560608 770923691 770692291 770010757
1859.3 770010757 770048523 770383530 770489807 772324524 773300552 772305756 771535110 770413971 771401596
1868 771401596 773076401 771807022 771943130 773279037 772500839 772614822 774829636 774835129 773352127
1876.7 773352127 771984482 773701401 775158463 773560715 774640503 776554489 776389389 774228058
1884.4 774228058 772403412 771551666 771745911 774375458 775208893 773456497 771473236 769777298 769950027
1893.1 769950027 772368088 774874115 775157394 775725250 775539169 774716339 774207611 773329163 773200760
1901.8 773200760 773776169 773599548 772899170 775187912 776155624 774788437 775043030 773531265 772831726
1910.4G72831726J910400P37534j56097l23334j785812p47910J804428N93720j62812
1919.1G74701843r49402j239166M41895J40609j078872j190491Q00858J372222K89689
1927.8G73289185j35804n69305l87116o78634M24194R68704l48053m39300k96478l50800
1937.5G71476593o03409O01959K696534M79660l321686j452179J591721N04684p20749
1946.1G71253128K65350P90711L06244M58297L82q00476j413956M09622K133942o92825
1955.8G72710419k125397P3090J662750J263656p24105j815873L71170J00632j439361
1964.5G70076981L21807J481171J997147j073609j695251R30862K95334k18124j712952
1973.1G70403366o38962J30310j741104P06177K111206l87344k304764j36337J516418
$$ plain form
1910.4 772831726 774742126 775479660 775323563 775000229 773214417 772466507 774270935 774864655 774701843
1919.1 774701843 773752441 772513275 772955170 773095779 772016907 770826416 771627274 772999496 773289185
1927.8 773289185 773153381 772584076 772196960 771518326 771942520 772911224 772563171 772123871 771827393 771476593
1937.5 771476593 770873184 771475143 774171677 774651337 771329651 769877472 771469193 771973877 771253128
1946.1 771253128 771518478 772309189 772615433 773073730 773074112 772273636 770859680 771269302 773403244 772710419
1955.8 772710419 770585022 770658112 772320862 773584518 772860413 771044540 771415710 771516342 770076981
1964.5 770076981 770398788 771879959 773877106 772803497 771108246 772039108 772334442 772116318 770403366
1973.1 770403366 769764404 769894714 768153610 768859787 770970993 770583649 768278885 768142548 769658966
1981.8G69658966Q10471l88184o19888O65207j727677k034149j86691L96194K171402
1990.5G68745651J987229m34571J9455J042862l391113j958542K012100l97567l815
1999.2G67621689N15747J163025m03061k037125P28226o2485j161270o75964J9684
2007.8G65708466O39267Q21838R14764o74057j658783L44544J598587j796494k560196
2016.5G63337936j25274N89523N49851K59780N5619j115113O81382R77401p03430k8992
2026.2G64478683j182251K137P42950m15802K7695N68924Q74786m71191L37295M72946
2035.8G65436172j562271r26437r78165j45721J524429o80160j779862L55149J417846
2044.5G62660980J010971O77185m87594k576142j540680M64478K61230L07007J058731
$$ plain form
1981.8 769658966 770469437 770081253 769461365 770126572 768398895 766364746 766178055 766574249 768745651
1990.5 768745651 770732880 770298309 770317764 771360626 767969513 766010971 768023071 767625504 767621689
1999.2 767621689 768137436 769300461 768897400 766860275 767588501 767526016 766364746 765688782 765708466
2007.8 765708466 766347733 767169571 768084335 767410278 765751495 766096039 767694626 765898132 763337936
2016.5 763337936 763212662 763802185 764352036 764611816 764667435 763552322 764233704 765211105 764507675 764478683
2026.2 764478683 763296432 763298569 764041519 763625717 763653412 764222336 765097122 764625931 764963226 765436172
2035.8 765436172 763873901 762947464 761969299 761823578 763348007 762667847 760887985 761243134 762660980
2044.5 762660980 763671951 764349136 763861542 761285400 759744720 760209198 760470428 760777435 761836166
2053.2G61836166O62537j125336K82822P74536p84225l40424j438293j829911r51004
2061.9G57086868J460724P26013j274337K130584O63605r84726L96118r0790m17480
2070.5G59696579j876907k243805k35672R47265p13730J89820P11670j621170j319580
2079.2G53534470j265564K11639N01328r28803l81699O91529J646576K9678m01840
2087.9G53637314k53296m84772P38678K43912j231461m76150J012344j261902o92062
2096.6G51232605K118607Q40454m39682q44803M41589J315689M8447q96378k10952
2105.2G53605576J540374K127610J061401j045837j135788j08262K8000n16052m50516
2113.9G55106506Q70972L65906m54178o64597k11715J035003J062622K49710p40585
$$ plain form
2053.2 761836166 762498703 761373367 761656189 762430725 761646500 761306076 759867783 758037872 757086868
2061.9 757086868 758547592 759273605 757999268 760129852 760793457 759808731 760204849 760114059 759696579
2070.5 759696579 757819672 755575867 755340195 756287460 755573730 755763550 756475220 754854050 753534470
2079.2 753534470 752268906 752480545 752981873 752053070 751671371 752362900 754009476 754039154 753637314
2087.9 753637314 753384018 752899246 753637924 753881836 752650375 752174225 753186569 751924667 751232605
2096.6 751232605 753351212 754191666 753751984 752907181 753348770 754664459 754712906 753816528 753605576
2105.2 753605576 755145950 757273560 758334961 757289124 756153336 756045074 756073074 755557022 755106506
2113.9 755106506 755977478 756343384 755889206 755224609 755012894 756047897 757110519 757360229 756619644
2122.6G56619644o16302k41242l85971n12237j44196Q99048q52966l277817p88346
2131.3G50699615J643448J585846J349335r75647o02341Q46253k65961J29471K24152
2140G54634171J077423J271515k25754n80750J10855J417389n7754j305619r3841m8065
2149.6G56199570j097184m18014J078949M26941K8152Q10700J330032k94571j500625
2158.3G56563950L63388Q26721j021042l1586L225861J116028j088486q23059j381302
2167G57750473N11627K95868o37359l03727j269455j505737O48575K745895N86472
2175.6G58822632j111374j170349o27899J047516J015625M8751o02188p13806o82678
2184.3G56026230N86395J291885R81598L54844k35520K55509j567307j554871R50547
$$ plain form
2122.6 756619644 756003342 755762100 755376129 754863892 754719696 755618744 754765778 751487961 750699615
2131.3 750699615 752343063 753928909 755278244 754302597 753700256 754546509 754280548 754410019 754634171
2140 754634171 755711594 756983109 756757355 756176605 756287460 757704849 757647095 756341476 756247635 756199570
2149.6 756199570 755102386 754684372 755763321 756190262 756218414 757029114 758359146 758064575 756563950
2158.3 756563950 756927338 757754059 756733017 756701431 759927292 761043320 759954834 759131775 757750473
2167 757750473 758262100 758557968 757920609 757616882 756347427 754841690 755490265 758236160 758822632
2175.6 758822632 757711258 756540909 755913010 756960526 757976151 758024902 757422714 756708908 756026230
2184.3 756026230 756612625 757904510 758886108 759240952 759005432 759260941 757693634 756138763 757089310
2193G57089310K801208K261200j167374j240921m37850N8288J360550R03778l81164
2201.7G61247025J48162P62635j053620L42560J965942j90506j952209q67233R17511
2210.4G61320267R49249J175537j176071j570206M37393r2392J094361J823501L94669
2219G64356308k297516j613541J103287P8964J010209J791687J39389K86636k0142
2227.7G64835281j493377j929550r94111M46625M05655K7084o60171j377869Q82950
2236.4G60142517J076126P57828J110992j222076p62939J46560r3155L04947J130600
2245.1G62591400R46579j410293j192322R91211J816101O5689j010742p14798K82821
2253.8G62365646J958008o28128j616363Q69217R71527m50592o56891K75650q18405
$$ plain form
2193 757089310 759890518 762151718 760984344 759743423 759305573 759363861 760724411 761628189 761247025
2201.7 761247025 761395187 762157822 761104202 761446762 763412704 763222198 761269989 760402756 761320267
2210.4 761320267 762269516 763445053 762268982 760698776 761136169 761043777 762138138 763961639 764356308
2219 764356308 762058792 760445251 761548538 761627502 762637711 764429398 764568787 764855423 764835281
2227.7 764835281 763341904 761412354 760418243 760864868 761270523 761297607 760637436 759259567 760142517
2236.4 760142517 761218643 761976471 763087463 761865387 761102448 761249008 761155853 761460800 762591400
2245.1 762591400 763537979 762127686 760935364 761926575 763742676 763808365 762797623 762082825 762365646
2253.8 762365646 764323654 763695526 762079163 762948380 763919907 763469315 762812424 763088074 762269669
2262.4G62269669j623764L2806J283112M28924N48706l00293j710205K25144P93609
2271.1G61947708J411057L56521j721267p22275J16882O87714J5716P95365M44107
2279.8G63331528j150132k09732l585J109695J585159L25775j815414k800598m78516
2288.5G59894180J987229J699066n65415M3946J984787J181259j756745p87811J419602
2297.2G65100098n53894q42972j345902o34002r5826r3536J686096n55877n3406J08795
2306.8G62719574o77414J625214l60642q57239P04194J078643K41776j816406j66474
2315.5G62491226J262665o57043j633606p75681k51617j487961n83496K639846K7695
2324.2G61032028j898575M0207L02048J481094J855240J434860L5172j5030r80225
$$ plain form
2262.4 762269669 760645905 760678711 761961823 762390747 762939453 762639160 760928955 761154099 761947708
2271.1 761947708 763358765 763715286 761994019 761271744 761388626 762076340 762092056 762887421 763331528
2279.8 763331528 762181396 761971664 761968079 763077774 764662933 764988708 763173294 760372696 759894180
2288.5 759894180 761881409 763580475 763015060 763059006 765043793 766225052 764468307 763680496 765100098
2297.2 765100098 764546204 763703232 762357330 761723328 761627502 761533966 763220062 762664185 762610779 762719574
2306.8 762719574 762042160 763667374 763306732 762449493 763153687 764232330 764474106 762657700 762491226
2315.5 762491226 763753891 763096848 761463242 760687561 760435944 758947983 758364487 761004333 761032028
2324.2 761032028 759133453 759173660 759475708 760956802 762812042 764246902 764282074 764267044 763286819
2332.8G63286819j944503l098679k930374O264877L708115j384506J445541m17480
2340.6G64929810j8616j610642O73218K227249m35714q58765k971573j578751R00803
2349.2G61257019J881409K25143j032028j349030J013031N835419k235947m860610
2356.9G60734406l293915j904221R368591K406464p613830J456069M399033j743317
2364.7G63809280J003037N520172q46481p321854k195511J376648P04193L060227K115555
2373.3G67225266K71301l16620o25916r42688p07397K72598N87769J431961p7286l6011
2383G67082977O70777m05503M88205j044388k401962r79538J262589J637573O11649
2391.7G66922379J746063M29230p77283J89361L97110q30917j107330N58700n06668
$$ plain form
2332.8 763286819 761342316 758243637 755313263 761578140 765286255 763901749 765347290 764929810
2340.6 764929810 764911194 763300552 763973770 766201019 765765305 764906540 761934967 760356216 761257019
2349.2 761257019 763138428 763363571 762331543 760982513 761995544 767830963 765595016 760734406
2356.9 760734406 757440491 755536270 764904861 767311325 759697495 761153564 765552597 763809280
2364.7 763809280 764812317 770332489 769486008 762164154 759968643 761345291 762049484 765109711 767225266
2373.3 767225266 767496567 767179947 766554031 765611343 764903946 765176544 765764313 767196274 767118988 767082977
2383 767082977 767753754 767348251 767836456 766792068 764390106 763410568 764673157 766310730 766922379
2391.7 766922379 768668442 769097672 768320389 768509750 768906860 768075943 766968613 767527313 767020645
2400.3G67020645p62787L25928M19693p00378j976471l22876L54156l98025N340J262741
2410G65227966J16883p74079J397248P37686r72443j714172n61981J605377P61490
2418.7G65823975Q1405m52957j047439R77325P42493j622162q95081n19638R54666
2427.3G64042587K098694p27310j133270n96009m52346j15052N18265R81827q95462
2436G63721924q49457p80640o69708R75266k50855j621551J06430O09512p63245J56327
2445.7G60634003J07727n35889o8970P36084J739121k02942o39496L63998m46090r66034
2455.3G60721512M272K41242j908570j102981N19333J188049O41098k233276q81119
2464G57189560J276016M09775J04599O2790N9433j33820j551056j62735K444992m9972
$$ plain form
2400.3 767020645 766257858 766583786 767003479 766303101 764326630 764003754 764357910 763959885 763965225 765227966
2410 765227966 765344849 764570770 765968018 766705704 765733261 764019089 763457108 765062485 765823975
2418.7 765823975 765905380 765452423 764404984 765382309 766124802 764502640 763607559 763087921 764042587
2427.3 764042587 766141281 765413971 764280701 763684692 763232346 763117294 763635559 764617386 763721924
2436 763721924 762872467 762091827 761422119 762397385 762146530 760524979 760631409 761240921 760477676 760634003
2445.7 760634003 760741730 760205841 760136871 760872955 762612076 762409134 761769638 762133636 761687546 760721512
2455.3 760721512 760725784 760967026 759058456 757955475 758474808 759662857 760303955 758070679 757189560
2464 757189560 758465576 758875351 758979950 759042740 759102173 758968353 757417297 757254562 759699554 759649582
2473.6G59649582j115875Q42437J04447k192154k348709N45349J423874l58505n48630
2482.3G56001816J110687K79312j747742K7314J510238o45065j568298M32358n03998
2491G54896622o18210K278519R13391j799088j496124J165390O53763j907502r96093
2499.7G53090668m41819K19269P00913m9515p3776O75354Q51898r81598n19638N74570
2509.3G54046326r81980r45129K0752O64444J273117j61972j654358j345062l53470
2518G50562668K23389o33774l6850J425934P1945j397782l78418M20075p59277l36762
2527.6G49161148J349411J098404m14581r79767l20053L20205J462098P75680n32150
2536.3G51920395q57315k186051k298812m98124K280808K045212q80280q25653Q94241
$$ plain form
2473.6 759649582 758533707 759376144 759480591 757288437 754939728 755485077 756908951 756550446 756001816
2482.3 756001816 757112503 757391815 755644073 755671387 757181625 756536560 754968262 755400620 754896622
2491 754896622 754278412 756556931 757470322 755671234 754175110 755340500 755994263 754086761 753090668
2499.7 753090668 752648849 752868118 753569031 753519516 753445740 754121094 754972992 753991394 753471756 754046326
2509.3 754046326 753064346 752119217 752139969 752804413 754077530 753915558 752261200 750916138 750562668
2518 750562668 750786057 750152283 750115433 751541367 751613312 750215530 749837112 750257187 749497910 749161148
2527.6 749161148 750510559 751608963 751194382 750214615 749894562 750214767 751676865 752452545 751920395
2536.3 751920395 751063080 748877029 746578217 746080093 748360901 750406113 749525833 748700180 749594421
2545G49594421O26908n20249o08749r84268L09753Q90122o69327m26254J69830J424332
2554.6G49806519M54483j771470j290664o25611l70025l09372N10559k9221q69064
2563.3G45506134L94440J389007J191788l44009j159211j476593p76062K92740j41144
2572G44877090j51596K5101M78058J44501n58319k10801K83585k59933o17600M51889
2581.6G44461975j011429q44650J421967K72750n03158p71256j78451K95868j44272
2590.3G42999344L17078j967316j348114J917801L08914m2801J56479j062241L44620
2599G41623764j17950p82471J175766O40945r84039j518860j257858L90625p34635
2607.7G38435287k516021M11911K234497J506958M22668j252365q98132q98972j067657
$$ plain form
2545 749594421 750221329 749701080 749092331 748108063 748417816 749307938 748638611 748212357 748382187 749806519
2554.6 749806519 750261002 748489532 747198868 746573257 746203232 745893860 746404419 746375198 745506134
2563.3 745506134 745900574 747289581 748481369 748137360 746978149 745501556 744725494 745018234 744877090
2572 744877090 744725494 744750595 745228653 745373154 744814835 744604034 744887619 744627686 744010086 744461975
2581.6 744461975 743450546 742605896 744027863 744300613 743797455 743026199 742847748 743143616 742999344
2590.3 742999344 743316422 741349106 740000992 741918793 742227707 742184906 742341385 741279144 741623764
2599 741623764 741505814 740723343 741899109 742540054 741556015 740037155 738779297 739169922 738435287
2607.7 738435287 735919266 736331177 738565674 740072632 740495300 739242935 738344803 737445831 736378174
2616.4G36378174K52609J81503j42364Q5068o07453j95007J324463J29928p74154j46485
2626G36486282m81949J66550J21384j57166M63257j479950l252106j011428P32116
2634.7G31586990J136170J701431m02603j150360q33740q15278N61905p28988p90787
2643.4G30264740N26886n18494n28335K48642l76663j089859n84336J01471J314240
2652G29358292O05774p96051K2888J51977N87464R8877j061631p74841n4550K50397
2661.7G28388596j227951j238785J52511K71454k02179n41687j19018J89285j36795
2670.4G25535431k6932J117859q75168l472137j41678J798096l47138k70157M13285
2679G23731461k5177m27857q05893k48489P8277O11m56238j522827o53076Q83407J309891
$$ plain form
2616.4 736378174 736630783 736812286 736669922 736754990 736147537 735952530 737276993 737406921 736632767 736486282
2626 736486282 736004333 736170883 736292267 736135101 736598358 735118408 731866302 730854874 731586990
2634.7 731586990 732723160 734424591 734021988 732871628 732037888 731222610 731784515 731055527 730264740
2643.4 730264740 730791626 730273132 729744797 729993439 729616776 728526917 727942581 728044052 729358292
2652 729358292 729964066 729168015 729190903 729342880 729930344 730029221 728967590 728192749 728138199 728388596
2661.7 728388596 727160645 725921860 726074371 726345825 726143646 725601959 725482941 725672226 725535431
2670.4 725535431 725508499 726626358 725751190 722279053 722137375 723935471 723588333 723318176 723731461
2679 723731461 723706284 723278427 722472534 722224045 722302322 722302933 721846695 720323868 719670792 720554199 721864090
2689.6G21864090N60303n13993j298675j223526L82233K25601p00608q15582L433P76902
2699.3G19260178l62244M21982N60074j251984r82056k72903K61459O16913o44760
2708G17606659j437912J88675L98102k71912m39529q59299M57153j27945j445236l77350
2717.6G13691406k62985l29971P65762R86557M0588p64389j548156j089707K38037
2726.3G11727142J79444n36957K72217o7826k324371j46484J299591l54843J18866
2735G10166779n70984j048203j003799p87125P41577M50516n48172n68314O62461J272354
2744.6G08767090J5793m40064l71628o74209q90198r57565K06299N65185o54602j015167
2754.3G04550934j452789k59934J442108M76990j103134j046982R55124N9357j950913
$$ plain form
2689.6 721864090 722424393 721910400 720611725 719388199 719770432 719996033 719295425 718479843 718483276 719260178
2699.3 719260178 718897934 719319916 719879990 718628006 717645950 717373047 717634506 718251419 717606659
2708 717606659 716168747 716357422 716755524 716483612 716044083 715184784 715641937 715513992 714068756 713691406
2717.6 713691406 713428421 713098450 713864212 714850769 714891357 714126968 712578812 711489105 711727142
2726.3 711727142 711906586 711369629 711641846 711574020 709249649 709103165 710402756 710047913 710166779
2735 710166779 709595795 708547592 707543793 706756668 707498245 707948761 707400589 706832275 707494736 708767090
2744.6 708767090 708782883 708342819 707971191 707296982 706406784 705449219 705655518 706220703 705566101 704550934
2754.3 704550934 703098145 702838211 704280319 704757309 703654175 702607193 703562317 703621674 701670761
2762.9G01670761j159210J54037J096421k08130q15201N52216L48281j205062k227478
2771.6F98206635j658936M22668J966172Q01925l00445p48749m23050Q9722p16858
2780.3F97639084k06223q10699j930237q09555N01022l27224q75550J065827M37622
2789F94684067r50470j198883r05304l42941r19037n3711k6017K79770O94352j978074
2798.6F89283752k136764R93881R83048k136994k055053R46807K079621o53000k143402
2807.3F85161896n14832O4240p98340k472077J70289J540069j478348j265716r49326
2816F79457855j94473k68707q90427k23999j510239j609268j4801Q76236k9831K99912
2825.6F75892258o11420k751160r05761q55790k01873R62677o25840r73815j363678
$$ plain form
2762.9 701670761 700511551 700665588 701762009 701553879 700738678 701290894 701639175 700434113 698206635
2771.6 698206635 696547699 696970367 698936539 699738464 699438019 698689270 698266220 698355942 697639084
2780.3 697639084 697432861 696622162 694691925 693882370 694383392 694056168 693180618 694246445 694684067
2789 694684067 693733597 692534714 691629410 691286469 690367432 690313721 690287704 690567474 691261826 689283752
2798.6 689283752 687146988 688140869 689123917 686986923 684931870 685878677 687958298 687305298 685161896
2807.3 685161896 684647064 684711304 683912964 681440887 681611176 683151245 681672897 680407181 679457855
2816 679457855 679263382 678994675 678104248 677880249 676370010 674760742 674745941 675622177 675592346 675892258
2825.6 675892258 675280838 672529678 671623917 670768127 670566254 671528931 670903091 669929276 668565598
2834.3F68565598p69043n32151j613464j876831j916733j163483o0958j042481k339630
2843F57250824j392441j905136j574402j214371l777084k824249p38831j238174k264633
2851.7F40321503l55263J726952q09021j881409r91554n28908m76494L48129J249314
2860.3F38603249l65448L58619L24822j754418j729507j724739j018791q73299j253395
2869F30567093j322861j148262o26221p28302r20600j647072k36359P53555K00501
2877.7F24891472L45688j094895j611900j164627M32663O45790p57790L57705n75905
2886.4F21468201k102928j425438J06430p23648j901589k57187n40237L11317q60405
2895.1F14074516k259102M37966p44553j243019j423683k152863J037140J023178k846222
$$ plain form
2834.3 668565598 667796555 667264404 665650940 663774109 661857376 660693893 660632935 659590454 657250824
2843 657250824 655858383 653953247 652378845 651164474 647387390 644563141 643824310 642586136 640321503
2851.7 640321503 639966240 641693192 640884171 639002762 638011208 637482300 637005806 637353935 638603249
2860.3 638603249 638237801 638596420 638921242 637166824 635437317 633712578 632693787 631820488 630567093
2869 630567093 629244232 628095970 627469749 626741447 625820847 624173775 623937416 624690971 624891472
2877.7 624891472 625237160 624142265 622530365 621365738 621798401 622444191 621686401 622044106 621468201
2886.4 621468201 619365273 617939835 618046265 617322617 615421028 615163841 614623604 614934921 614074516
2895.1 614074516 611815414 612253380 611508827 610265808 608842125 606689262 607726402 608749580 605903358
2903.7F05903358k565383O29997N15518L4294m1389j122132r32960j59950r67942k928581
2913.4E98364830j220818J308632N59349j643600j972656p4845j121788j960067m85611
2922.1E91753426J52664m37966j069603l88298k59094P4501J698303J846314j429939
2930.7E91940308k061081K31781M8980O33774M10195O06422K473068J011887p51953
2939.4E94543381n94673l81318n2452J424408J881752J46180n67437M7646O5880J08337
2949.1E96621704L27530j149902k594185j032562J576042k42653j769142J126403J168900
2957.7E94032135N37453O8969j793212n06936J223183o2408l39089J169472K90718
2966.4E94620285L96309K23427K19497K681199J089935K68783R14994J229782J576309
$$ plain form
2903.7 605903358 603337975 603967972 604483490 604517784 604476395 603354263 602421303 602261353 601293411 598364830
2913.4 598364830 597144012 598452644 599011993 597368393 595395737 595320892 594199104 592239037 591753426
2922.1 591753426 591906090 591468124 590398521 590010223 589751129 589825630 591523933 593370247 591940308
2930.7 591940308 589879227 590111008 590159988 590793762 591203957 591810379 594283447 595295334 594543381
2939.4 594543381 593948708 593567390 593514938 594939346 596821098 596967278 596399841 596447487 596513367 596621704
2949.1 596621704 596949234 595799332 593205147 592172585 593748627 593505974 591736832 592863235 594032135
2957.7 594032135 594569588 594638557 592845345 592338409 593561592 593499184 593160095 594329567 594620285
2966.4 594620285 595016594 595240021 595459518 598140717 599230652 599499435 600414429 601644211 603220520
2975.1F03220520m07715N40009J968651K618217J801491j2169J873855P72667j148948
2983.8F11226578L04413l2692k1477K166214L047485J308136n5160Q85963R24492k77367
2993.4F19476585q92524m95987J261558M71649J526J097374m63524l8147R77402L08762
3003.1F21704674m29154j008911P81174J962471m71192k128143l27034J50147K24266
3011.7F20458298O09436j25962R1210o88629n64270N68466N94292q79593j150627j6938
3021.4F18895683j468315n76744Q18939m33769q15849O42814l0098k388725l28369
3030.1F14315567j18179n76744M4670N8326O12793k505607j939240J027680J279907
3038.7F12199173q99925j859513J075821m48303j668587q61206L25852N21812k162857
$$ plain form
2975.1 603220520 602812805 603352814 605321465 607939682 609741173 609729004 611602859 612375526 611226578
2983.8 611226578 611530991 611498299 611476822 613643036 616690521 617998657 617943497 618829460 619753952 619476585
2993.4 619476585 618584061 618088074 619349632 619821281 619822807 620920181 620456657 620418510 621395912 621704674
3003.1 621704674 621275520 620266609 621047783 623010254 622539062 620410919 620083885 620234032 620458298
3011.7 620458298 621067734 620941772 621032982 620344353 619780083 620348549 620942841 620063248 618912621 618895683
3021.4 618895683 617427368 616850624 617669563 617235794 616419945 617062759 617032661 614643936 614315567
3030.1 614315567 614197388 613620644 613665314 613723640 614336433 611830826 609891586 610919266 612199173
3038.7 612199173 611299248 609439735 610515556 610067253 608398666 607537460 607863312 608385124 606222267
3047.4F06222267m21562q16994k134666K26974p00569j015282Q78830N37453l29475
3056.1F02446976l06855j253891j177558P2097n14145j465339j67809J10703o85692
3064.8E97058487K9068m62418l76892p83615L27568R93538k597313p47948P34673r85146
3074.4E93190002q63342j094398J81160Q61854P54509j97792j969147j882019N6687
3083.1E89037514M11224k62756J8387j357727p11747j286583j578941J093254k70576
3091.8E85092049q16231p83157j115876l34472K49939Q54568l52821o63262r21364
3100.5E81209373r47189m9095r92165j407051n24864o78520k70805Q34388N8403l55110
3110.1E76877365j579208j940613p11708k47917K22511j169548l89710o98623j535378
$$ plain form
3047.4 606222267 605800705 604983711 602849045 603076019 602375450 601360168 602238998 602776451 602446976
3056.1 602446976 602140121 600886230 599708672 599780769 599266624 597801285 597633476 597744179 597058487
3064.8 597058487 597087555 596625137 596248245 595464630 595792198 596785736 594188423 593440475 594175148 593190002
3074.4 593190002 592326660 591232262 591413422 592275276 593029785 592831993 590862846 588980827 589037514
3083.1 589037514 589448738 589185982 589204369 587846642 587134895 585848312 584269371 585362625 585092049
3091.8 585092049 584275818 583492661 582376785 582042313 582292252 583146820 582793999 582130737 581209373
3100.5 581209373 580262184 580213089 579220924 577813873 577289009 576610489 576339684 577174072 577232475 576877365
3110.1 576877365 575298157 573357544 572645836 572397919 572620430 571450882 571061172 570362549 568827171
3118.8E68827171N7640r27887n92193q04138p37839l12042j95160R60083m81873n62744
3128.4E65231018k234230k733345L39890q14705j794815l45650l82996m71115N66979
3137.1E57361031p95441j077919l86009k440453j663208r74274r72061L74604k37694
3145.8E49188576r09500m96483q7471l15743j267471j663933n74226j018410j918373
3154.5E40936966j563377j020966N32570k27432r23806k04467o84662q10204j146049
3163.1E34888573j187554j096153p70683m2610j91384j941376k579879P5073P83806
3171.8E27937813j979408l673401m92592J656227j367149j407204J58119r76448j183014
3180.5E18672943o73103r10874o89811m18053o54144q03643q98704o23398k18162n77622
$$ plain form
3118.8 568827171 568884811 567956924 567364731 566560593 565822754 565510712 565315552 566275635 565793762 565231018
3128.4 565231018 562996788 560263443 560603333 559788628 557993813 557648163 557265167 556794052 557361031
3137.1 557361031 556565590 555487671 555101662 552661209 550998001 550023727 549051666 549426270 549188576
3145.8 549188576 548279076 547782593 547695122 547379379 546111908 544447975 543873749 542855339 540936966
3154.5 540936966 539373589 538352623 538885193 538657761 537733955 537529488 536844826 536034622 534888573
3163.1 534888573 533701019 532604866 531834183 531791573 531600189 529658813 527078934 527154007 527937813
3171.8 527937813 525958405 522285004 521792412 523448639 522081490 520674286 520832405 519855957 518672943
3180.5 518672943 517999840 517088966 516399155 515981102 515326958 514523315 513624611 513001213 512783051 512205429
3190.1E12205429j741180p33643j36337j087227n17654k497483k351799l46565j360779
3198.8E01432762J20316R59167j35879m85154j128921j725121r69886p5150j446533
3207.5D96545601j371842j73797p96280n55420L46489j574821k948227l73116L06091
3216.2D89404678j32141J91651j721268k507439p75947r04847j248855J90124L76511
3224.9D82872467m90150j613579j189194m23050j425056o00586O47011L60336n59540
3233.5D77578659n07584o03408j939965j891403j059761k7313K45437O05736l64761
3242.2D72035637k127533n36690q3160j055336q78678m85878j246147q96949J217498
3250.9D65942764p23991k805481j135483N03922o11039o66999L06816j361313o43082
$$ plain form
3190.1 512205429 510464249 509730606 509594269 508507042 507989388 505491905 503140106 502793541 501432762
3198.8 501432762 501553078 502512245 502376366 501891212 500762291 499037170 498067284 497992134 496545601
3207.5 496545601 495173759 494999962 494203682 493648262 493994751 492419930 489471703 489098587 489404678
3216.2 489404678 489272537 489464188 487742920 485235481 484459534 483554687 482305832 482495956 482872467
3224.9 482872467 482382317 480768738 479579544 479156494 477731438 477130852 477777863 478138199 477578659
3233.5 477578659 477071075 476467667 474527702 472636299 471576538 471549225 471794662 472400398 472035637
3242.2 472035637 469908104 469371414 469288254 468232918 467354240 466868362 465622215 464725266 465942764
3250.9 465942764 465218773 462413292 461277809 461781731 461170692 460503693 460810509 459449196 458806114
3259.6D58806114k03361p95861o90536j671524r8572J117134n02510k483635j634979
3268.3D51842270Q91151J085472m85458j178398k93198j075325m02946O32286j559639
3276.9D49456215k023125o44111R8686q12111r95293M78363J220475j26420k289772
3285.6D44362907k269096o55327Q44269K5978l71017n15557j366882M78477J76049
3294.3D40709801j394882j526833r73892K79922l0441m0093M66423m15954j493797
3303D35580254n7488M67682j017876j087761j250114q53424p40051m3908l56674j318741
3312.6D29321899J465989R98458j588363k344589j981278l2463j78986j542396j699104
3321.3D22419167k48375K16713j46485m83360j911659k84462J112365r05838j527137
$$ plain form
3259.6 458806114 458602753 457806892 457116356 455444832 455346260 456463394 455960884 453477249 451842270
3268.3 451842270 452733421 453818893 453333435 452155037 451861839 450786514 450383568 451015854 449456215
3276.9 449456215 447433090 446788979 446887665 446075554 445080261 445558624 446779099 446652679 444362907
3285.6 444362907 442093811 441438484 442282753 442308731 441937714 441422157 440055275 440533752 440709801
3294.3 440709801 439314919 437788086 436814194 437094116 437063675 437023582 437490005 437074051 435580254
3303 435580254 435522766 435990448 434972572 433884811 432634697 431781273 431041222 430997314 430640640 429321899
3312.6 429321899 430787888 431786346 430197983 427853394 425872116 425839653 425660667 424118271 422419167
3321.3 422419167 422170792 422387505 422241020 421757660 419846001 419561539 420673904 419768066 418240929
3330D18240929l39470o43311j557007r34944j125946j037407O49338J018867j286239
3338.7D12984810k371941j248779j505089j030388j36718J25961m61464j116028L19710
3347.3D05560074o7291l49884j009293k628517j725884j443901o86531j264496j930923
3356C94453354l60527o88400j66626P91397J74293j806259k546234k53525O63605j55106
3365.7C90105972j169967m66919J54915j425171j904068q12378k61727j617050j990280
3374.3C80613327p10030n2108q19130j353760l8681p02019j520653j64451N26962P4234
3384C75853691q66966j541023j506462M17976j98288k748337o29883J522293k37083
3392.7C70065918j093369J95008p2289N75295J4801k223473r91974j037445n66597
$$ plain form
3330 418240929 417901459 417258148 415701141 414766197 413640251 412602844 413252182 414271049 412984810
3338.7 412984810 410612869 409364090 407859001 406828613 406691895 406817856 406356392 405240364 405560074
3347.3 405560074 405492783 405142899 404133606 401505089 399779205 398335304 397648773 396384277 394453354
3356 394453354 394092827 393404427 393237801 394029198 394203491 392397232 389850998 389597473 390261078 390105972
3365.7 390105972 388936005 388469086 388624001 387198830 385294762 384482384 384220657 382603607 380613327
3374.3 380613327 379903297 379851189 379032059 377678299 377639618 376937599 375416946 375252495 375779457 375853691
3384 375853691 374986725 373445702 371939240 372357216 372158928 369410591 368780708 370303001 370065918
3392.7 370065918 368972549 369167557 369095268 369670563 369685364 367461891 366469917 365432472 364865875
3401.3C64865875j07536m19617J171952k55280q48770k14882n40772K72027P43026
3410C64666023L4485j117630r20753o46019p706o79817m98696J774979j99852j355705
3419.7C61049309k15225k02980l34664l11775J59836o23207l77732J257096J249160
3428.3C61649818j173400j893998p1983Q74252J425553l97797r49020M50172J95923
3437C60109520N73387k64358j145974K3041J458130J106033J26419P76787P50046J38550
3446.7C63651581k11792o08559j029472N82428J243629m43382Q70438J956062R59625
3455.3C66970558J46179R48410J195603o79093J66398Q85162m33655r12857L6926J463089
3465C69786720J916733K057343Q49113o98662m04930Q65669J139832Q00095k35863
$$ plain form
3401.3 364865875 364758339 364338722 365510674 365255394 364406624 364191742 363650970 363922997 364666023
3410 364666023 364700508 363582878 362662125 362016106 362008400 361328583 360829887 362604866 362405014 361049309
3419.7 361049309 360834084 360631104 360296440 359984665 360144501 359521294 359143562 360400658 361649818
3428.3 361649818 360476418 358582420 358510437 359384689 360810242 360412445 359463425 359913597 360109520
3437 360109520 360682907 360418549 359272575 359295616 360753746 361859779 361986198 362762985 363513031 363651581
3446.7 363651581 363439789 362831230 361801758 362384186 363627815 363184433 364054871 366010933 366970558
3455.3 366970558 367116737 368065147 369260750 368581657 368748055 369633217 369199562 368286705 368323631 369786720
3465 369786720 371703453 373760796 374609909 373911247 373506317 374371986 375511818 376311913 376076050
3473.7C76076050j008682P36427J177444J294060J127014k18429K04582J145096K101097
3482.3C82634659R16023k09618l40843K19803K280159O90880n87769J408577R79081
3491C87990952o45371M85497J344833j411n99480O33240L279686J365890n91469K379456
3500.7C95641823K190094O41975J055908J285515m7722j063728L88947J680984J379623
3509.4D03153419J108284J971741p6370o79588J076049p62939J63689K756042J451645
3518D10161972L29361J068649O32286Q77457O21643r53827J516953J825371J089591
3526.7D17169456J239777K98996J204453Q62693Q19931K83356P2022J592254K154656
3535.4D25697594J530342M05044J438637q9378n61600K172356K057838J854324J268120
$$ plain form
3473.7 376076050 375067368 375803795 376981239 378275299 379402313 379183884 379388466 380533562 382634659
3482.3 382634659 383550682 383341064 383000221 383220024 385500183 386191063 385603294 387011871 387990952
3491 387990952 387345581 387831078 389175911 389174500 388575020 389208260 392487946 393853836 393262367 395641823
3500.7 395641823 397831917 398473892 399529800 400815315 400767593 399703865 400092812 401773796 403153419
3509.4 403153419 404261703 406233444 406157074 405477486 406553535 405790596 405954285 408710327 410161972
3518 410161972 410491333 411559982 412192268 413069725 413691368 412737541 414254494 416079865 417169456
3526.7 417169456 418409233 418708229 419912682 420775375 421595306 421878662 421950684 423542938 425697594
3535.4 425697594 427227936 427632980 429071617 428982239 428420639 430592995 432650833 434505157 435773277
3544.1D35773277O03447Q21991J328812J58005j72425J634445J554719K223091J428718
3552.7D45354080O98014K077026J483459P31240M35409J988373K231216J031495J648521
3561.4D57678833J393089p82432O97098M026680R70382p35550O45829J973991K163391
3570.1D68031311K76184J570435J502762K520370K088966P66907K712898J041108J378097
3578.8D81889038P47299Q73146L357010K123108J512108J371574K888985O10619n90325
3587.5D94782562L119622J97105K110214L349571M130783K401810K61192K014046j095848
3596.1E11271057L378983L768081r60884L314896L090782J384125K479210J043434
3603.9E28769684J404342L054772J002083o62232O347008M388619p31812L822632K045746
$$ plain form
3544.1 435773277 436376724 437198715 438527527 438685532 438513107 440147552 441702271 443925362 445354080
3552.7 445354080 446052094 448129120 449612579 450343819 450779228 452767601 454998817 456030312 457678833
3561.4 457678833 459071922 458289490 458986588 463013268 463983650 463248100 463893929 465867920 468031311
3570.1 468031311 468307495 469877930 471380692 473901062 475990028 476756935 479469833 480510941 481889038
3578.8 481889038 482636337 483509483 486866493 488989601 490501709 491873283 494762268 495372887 494782562
3587.5 494782562 497902184 498099289 500209503 503559074 507689857 510091667 510352859 512366905 511271057
3596.1 511271057 514650040 518418121 517457237 520772133 523862915 525247040 527726250 528769684
3603.9 528769684 530174026 533228798 534230881 533568649 539915657 544304276 543572464 547395096 549440842
3612.5E49440842L76320K136879R50088M235077K714691l92799L997421J868782k09579
3621.2E65117722K020111O75239J106529M196396M373246L469505N255661L041992
3628.9E89256401n344925K223129M368668L422661J071091P52372M628296M947815
3636.6F05325508J398468k50549J734543L611984M370155R29108k30866K650452L312149
3645.3F22850952N449906K603912J822662O947861j090508l833885j079254L271942
3653F36943588L622132M826355N812988n403977J831284M895096M98047O09436J536102
3661.7F55171051L657608J75705k45514K778778J860581L567428K194061R58252K953721
3670.4F73071671m468232K08207O791915P014389j558685j2343750J337586P652893
$$ plain form
3612.5 549440842 549817162 551954041 552904129 557139206 559853897 559461098 563458519 565327301 565117722
3621.2 565117722 567137833 567813072 568919601 573115997 577489243 580958748 586214409 589256401
3628.9 589256401 583911476 586134605 590503273 593925934 594997025 595749397 600377693 605325508
3636.6 605325508 606723976 606473427 608207970 611819954 616190109 617119217 616888351 619538803 622850952
3645.3 622850952 628300858 630904770 632727432 639675293 638584785 634750900 633671646 636943588
3653 636943588 640565720 645392075 651205063 645801086 647632370 652527466 653025513 653634949 655171051
3661.7 655171051 658828659 659004364 658758850 661537628 663398209 666965637 669159698 670117950 673071671
3670.4 673071671 668603439 668811646 675603561 682617950 681059265 668715515 670053101 677705994
3678.1F77705994N187149j241989L26385J847458K774506P54013k433930K67716M453888
3686.8F89641190O398010q776245l327408R588470l305359k146301J679459J87378
3694.5F89939194K488937r13391j091080J822129J219940J449737L799057j349029
3702.2F97365494k894440M002838J083145J82495J412201L227387K448578j0201264
3709.9F96626434N314026Q370667j1473694J581039L095093J79596K61765L375015
3717.7G07329941L027191l679123J237564O684723k445068o148606K185288L2196o63986
3726.3G07560120k092514J417007L650055o866O585388L64303o432342R169616J938096
3735G22152863j1167069o587143J332779N093231L140412N03692n065155L768311J4645614
$$ plain form
3678.1 677705994 682893143 681651154 681977539 683824997 686599503 687353516 684919586 685187302 689641190
3686.8 689641190 696039200 687262955 683935547 693524017 690218658 688072357 689751816 689939194
3694.5 689939194 692428131 691514740 690423660 692245789 693465729 694915466 698714523 697365494
3702.2 697365494 694471054 698473892 699557037 699739532 701151733 704379120 706827698 696626434
3709.9 696626434 701940460 710311127 698837433 700418472 703513565 703693161 703954926 707329941
3717.7 707329941 710357132 706678009 707915573 714600296 712155228 706006622 708191910 708224106 707560120
3726.3 707560120 705467606 706884613 710534668 710527802 717113190 717477493 711045151 720214767 722152863
3735 722152863 710985794 704398651 705731430 710824661 713965073 714468765 709403610 713171921 727817535
3743.7G27817535n294952k1780090Q234481N994111N359726m565812q133697J2824020
3751.4G20455322j187439p262573N041504K584000P04956n387955O12106N001831l340377
3760.1G17221375j819153L170318J04676n02167M984283k519836n929947L021927M472656
3768.8G22204132J088867p445678M44793K642441P63l90244J603J736145r24530J984863
3778.4G21343155L42560o522141L160401R63592j401596K000961r43451j942596j16577
3787.1G16884308J417007Q81119l36075M97360M42734L79792j14975J704483K869110
3795.8G24624863m102173m512100J361312M316102O903839j042252r071121m2496J255646
3804.4G19691620M568939N750961r197692n425873L496246P73544O30570K437973o31943
$$ plain form
3743.7 727817535 722522583 700742493 708976974 714971085 720330811 715764999 707631302 720455322
3751.4 720455322 719267883 712005310 717046814 719630814 720335770 714947815 715559921 720561752 717221375
3760.1 717221375 715402222 718572540 718677216 718175049 723159332 720639496 714709549 717731476 722204132
3768.8 722204132 723292999 715847321 716292114 718934555 718935318 718545074 718546677 720282822 719358292 721343155
3778.4 721343155 721685715 715163574 718323975 719287567 717885971 719886932 718943481 717000885 716884308
3787.1 716884308 718301315 719182434 718846359 719343719 719786453 720166245 720051270 721755753 724624863
3795.8 724624863 720522690 716010590 717371902 721688004 728591843 727549591 718478470 718435974 719691620
3804.4 719691620 724260559 730011520 720813828 715387955 718884201 719657745 720288315 722726288 722094345
3813.1G22094345l255615L765640K612000j1682282L857041N054931K824326j197586
3820.8G24072800j3769226M081649M852066J600647K627869J273727k840652j704407
3828.6G20194473J026612L464737K988052q914566n70068P856826m980240k373733
3836.3G18692093O344376r602204k537308Q371735j118240K15225M534454k508087
3844G22392044m746551K156143J488723j079864J300049r03931J124954M647141q49686
3852.7G25529022P508316j3780441n502014P374496K84577k270661j003418J647721
3860.4G19787598M382858m173203j016616O989364m648361p308197K765274N844574
3868.1G22623291R149246p908554j3239593M202652O793365M235153r238357K45361
$$ plain form
3813.1 722094345 718838730 722604370 725216370 713534088 717391129 722446060 725270386 724072800
3820.8 724072800 710303574 714385223 719237289 720837936 723465805 724739532 721898880 720194473
3828.6 720194473 721221085 724685822 727673874 718759308 718189240 726046066 721065826 718692093
3836.3 718692093 725036469 715434265 712896957 721268692 720150452 720365677 724900131 722392044
3844 722392044 717645493 719801636 721290359 720210495 721510544 720606613 721731567 726378708 725529022
3852.7 725529022 733037338 719256897 713754883 721129379 721413956 719143295 718139877 719787598
3860.4 719787598 724170456 719997253 718980637 725970001 721321640 714013443 716778717 722623291
3868.1 722623291 731772537 723863983 710624390 714827042 721620407 725855560 716617203 716862564
3875.8G16862564M746933o21872J203461M208832l027649o395722M484482K52152l47214
3884.5G21365967M243316j0469436n39551K521210k62757L961945R40247o724015J757584
3893.2G16794510M250793k540130M07715J706237K018204J834259r783783L313523
3900.9G18001328K607345m145126M858093j872864p80487J970520K47650j392212l202285
3909.6G16291962J549530J075134r62753K47879m72565J283340K605057l637085l962631
3918.2G14017868L588409J102677l638840Q39K265931K460250j126785k884064J128312
3926.9G16914597K601165J293488p09686r4605J060944k694550k186889R31091j128388
3935.6G15987167j8234J772614q27103m95911l80172O59256K437286j890411n25208
$$ plain form
3875.8 716862564 721609497 720987625 722191086 726399918 723372269 716976547 721461029 721713181 721365967
3884.5 721365967 725609283 715139847 714600296 717121506 716858749 720820694 721760941 715036926 716794510
3893.2 716794510 721045303 718505173 718912888 720619125 722637329 724471588 714687805 718001328
3900.9 718001328 720608673 716463547 721321640 719448776 718668289 720638809 720886459 719494247 716291962
3909.6 716291962 717841492 718916626 717953873 718201752 717729187 719012527 721617584 717980499 714017868
3918.2 714017868 717606277 718708954 715070114 715070953 717336884 719797134 718670349 715786285 716914597
3926.9 716914597 719515762 720809250 720099564 720004959 721065903 718371353 716184464 717115555 715987167
3935.6 715987167 715968933 717741547 716914444 716418533 716038361 716697617 719134903 717244492 716719284
3944.3G16719284k73819p15866K853928q33130j60828P08160k699203O06689J204911
3953G17410126J003799M99115J52741K69470j620865j519470p84989J858979J38549
3961.6G17407455j622238J391449o10199q4305O94046m01992J395416m22211q21380
3970.3G16926041J201553n84183j604843r99069O77643J830978o82754P37075K559815
3979G20062256j835251k845383O55289J137466n82199n4092m59366q80737J634445
3987.7G16832428J403656l38745p14417J04447Q00628k35366o77414j047364j261673
3996.3G14866180J84937J511307M91485l86429
4000.2G16667480
$$ plain form
3944.3 716719284 716445465 715729599 718583527 717750397 717589569 718297729 715598526 716205215 717410126
3953 717410126 718413925 718913040 719065781 719335251 717714386 716194916 715409927 717268906 717407455
3961.6 717407455 715785217 717176666 716566467 716482162 717176208 716774216 718169632 717747421 716926041
3970.3 716926041 718127594 717543411 715938568 714939499 715617142 717448120 716765366 717502441 720062256
3979 720062256 718227005 715381622 716036911 717174377 716592178 716538086 716078720 715197983 716832428
3987.7 716832428 718236084 717897339 717182922 717287369 718087997 717852631 717175217 716127853 714866180
3996.3 714866180 715051117 716562424 717053909 716667480
4000.2 716667480
##END=$$ End of the data block
