##TITLE=$$ Begin of the data block
##JCAMP-DX=5.00 $$ ACD/SpecManager v 10.08
##SPECTROMETER/DATA SYSTEM=Varian
##DATE=07 Jan 2013 10:56:38
##DATA TYPE=INFRARED SPECTRUM
##DATA CLASS=XYDATA
##ORIGIN=
##OWNER=
##NPOINTS=3735
##FIRSTX=399.26403809
##LASTX=4000.35498047
##MAXX=4000.35498047
##MINX=399.26403809
##MAXY=105.92037964
##MINY=9.68995285
##XFACTOR=1.0000000000
##YFACTOR=0.000001000000000
##FIRSTY=76.84297180
##DELTAX=0.96440572
##XUNITS=1/CM
##YUNITS=TRANSMITTANCE
##XYDATA=(X++(Y..Y))
399.3 76842972 70060486 65649963 56487709 44699085 57739086 91355476 87042679 72744965
407 72744965 67469200 58294827 50880165 58265411 71788857 70517868 60109417 48239021
414.7 48239021 47300064 53753910 66304390 105920380 79833748 60767376 51466724 35772236
422.4 35772236 39204956 51964211 54578049 56800327 56636852 63016315 71520172 68727760 57902561
431.1 57902561 46550114 47011845 58195839 61703785 59605400 57386299 46757435 43949711
438.8 43949711 57620789 59252068 51678795 53915150 52088024 51839954 63486336 64715614
446.5 64715614 50097782 46417042 47449245 48680069 56083889 61909351 56540318 51321251
454.2 51321251 55614376 58142597 51006569 48266491 57798031 61747898 58080280 56530003 51010818
462.9 51010818 43561440 41109577 36996033 35194290 43643990 50647602 49241276 47920334 46483814
471.6 46483814 50192436 52259579 53661446 59238621 52386436 50996998 55902447 48010891 45581043
480.3 45581043 52142563 55946022 56218922 56359768 55249035 52488804 50633400 51142548 53683743
489 53683743 56268837 58382172 59272739 56200363 49107990 47753628 53436028 56535423 56137955
497.6 56137955 52303509 50995258 52935406 54487846 53024792 49126469 51574047 52593060 52103779
506.3 52103779 52284195 49649204 51828690 55584538 58382835 57717846 52482727 48707336 47999874
515 47999874 50329475 48498138 44796230 44030182 45780415 49241001 48239037 48481159 51110909
523.7 51110909 50218620 49197762 49376858 48731312 48004173 47342255 47280937 48385654 49755882 49141232
533.3 49141232 49451538 52349419 51765091 50218643 49830040 49583584 50688095 49335678 49243660
542 49243660 50403656 50308617 50172169 47688641 47195797 48418255 49590015 50121792 47698189 45841007
551.6 45841007 45395985 47091476 49068565 49251015 49833740 51245468 51722073 50261612 48962116
560.3 48962116 47705418 48051270 50022648 50415936 50267551 50785759 50381695 48855301 49208763
569 49208763 47829102 45755848 47252827 48555496 49466125 49555573 48694698 48748127 50230396 51660042
578.6 51660042 49678303 47263729 47136013 48877060 50607342 49326427 47730953 48074348 49012787
587.3 49012787 50004005 51307991 51815178 51495949 51009571 49572903 48981831 50837231 50795650 46801575
597 46801575 44017208 45640736 49229900 49071228 47234825 46264961 44221100 45743675 49490711
605.6 49490711 49332722 46750854 45015530 44586086 42672794 41663975 40589764 36410011 34244377
614.3 34244377 34465954 35895298 38094120 38565918 37349945 35694168 35276649 34972839 33470692
623 33470692 31992739 31292721 32006279 34181828 36500435 38229992 40408333 41860416 42360207
631.7 42360207 42610157 42497910 41616348 40061848 39765297 39367107 37914623 36712517 36385201
640.4 36385201 38105286 40427597 42002712 42989037 44186157 46480862 49132328 50568096 49440323
649 49440323 48698498 49944225 49780125 50382450 52045689 51869808 52082493 51971348 51044086 49807114
658.7 49807114 49213001 50544445 51947811 51865810 50782795 51823883 53078064 52914402 55027008
667.4 55027008 55792957 53038586 53597969 54697742 55278988 55127876 55051788 54519276 53234131 53810577
677 53810577 56312248 56015514 53685631 52111141 52378559 54197956 53663612 52702877 53484131 53712891
686.7 53712891 53016781 53765015 55234711 54477005 53765385 52644157 51855686 52831440 52859833 52347801
696.3 52347801 51724720 51138073 51332096 52382290 52259850 51293056 51460567 50745892 49955387 50775742
705.9 50775742 52617050 52767239 52368141 53297211 52666103 52641232 53039398 52667061 53093567 54292133
715.6 54292133 55589172 54493122 53719391 54417301 54430386 55148640 56258991 55970566 54957172
724.3 54957172 55119846 55300320 55229679 55471359 56116653 56376152 55292351 55003712 54138126 53006882
733.9 53006882 53722778 54354145 54527107 54799198 55136459 54743473 54107704 53983299 53955307 54137325
743.6 54137325 54526379 55376259 56206902 56200737 54901176 54262089 55552296 56487183 56531384 56801926
753.2 56801926 57551468 58473282 59616673 59471832 57998993 57362164 56994270 57409599 58456886
761.9 58456886 58015800 57437611 58350254 58442383 57187000 57488800 58311855 57875626 57911583 58923809
771.5 58923809 59294689 59276222 59239292 58890667 58584713 58280369 58917820 59203560 59396217 60615494
781.2 60615494 60221146 59638752 60047417 60614830 60878719 60484062 60632942 60465008 59874767 59564472
790.8 59564472 60224239 60948017 60261417 60372200 60544643 60329788 60902245 61198441 61467327 61198616
800.5 61198616 60865738 61227760 60833855 60734386 61598198 61549576 60843803 61321144 62138519 61969997
810.1 61969997 62128777 62071796 61575592 61939266 62005131 61483654 60820953 61479385 63574371 63657455
819.7 63657455 62783901 63015995 62488903 61435493 61727722 61491016 60535950 60640301 60054111 59804268
829.4 59804268 60285114 60112366 60338383 60580574 60497101 59460903 58712654 58872135 58564255 58539986
839 58539986 57466225 56546146 56811970 55838951 55665543 56697201 56795574 56681362 56870045 56769970
848.7 56769970 56951984 57779202 57771961 56339035 55581745 56632870 57836861 58309120 58205059 57998951
858.3 57998951 58198872 58422352 59375469 60639908 60467133 59902870 60554020 61569977 61519093 60933250
868 60933250 60693195 60699276 61333008 62305218 62424995 61926285 61569977 61419464 61621246 61700649 61091976
878.6 61091976 60656036 60569820 60584049 60822624 60915798 60994370 60973171 60489517 59723938 59424549 59923386
889.2 59923386 60307644 60016247 59802502 60477509 60284531 58965714 58791218 59245564 59723274 59527718
898.8 59527718 58620483 58433468 58941429 59695614 59918289 60146553 60289272 59716286 59088150 58565487
908.5 58565487 58589451 58183605 57543072 57063133 56363136 56686527 56731976 56036057 55584049 55181923
918.1 55181923 54714123 54215874 54255802 53929615 53232548 52756226 52848091 53866173 54326199 53975380
927.8 53975380 53185455 52942211 53426369 53333328 53282375 53585674 53775208 53653088 53567776 53607986 54034351
938.4 54034351 55121662 55572201 55656975 55918846 55912334 56215759 57084446 57835407 58185745 58615181
948 58615181 58520756 58103748 58226696 58207451 58306068 58634880 59020031 59446888 59154728 58705120 58671520
958.6 58671520 58415176 57750134 57249516 56510712 55691582 55704170 55610462 55707001 55737381 54779018 54479427
969.2 54479427 54719738 54769035 54732780 54275627 53752346 53849270 54664982 54522560 53782822 53795013 53719906
979.8 53719906 53512436 52776497 52037598 52259041 52618469 52625050 52181271 52012947 51845734 51021107
989.5 51021107 50321194 49563744 48836487 48299557 47068420 45008942 42936043 42633194 44630028
998.2 44630028 46810959 48154388 48760597 48469803 48149597 47866425 47727333 47539421 47193256 47290932
1007.8 47290932 47472401 47763981 47524025 47273468 47390362 46978951 46996422 46639080 45800175 45807228
1017.5 45807228 46060001 45920227 45192524 44626816 44503345 44267529 44043106 43912338 43485443 43339222
1027.1 43339222 43477890 43028172 42981285 43090862 42480350 41907124 41742855 41583950 41440720 41582069
1036.7 41582069 41165852 40775993 40658184 40578598 41136208 41462776 41599121 41514572 40894260 40575859
1046.4 40575859 40756489 40984509 41247776 41222427 40768505 41168377 41584869 41149727 41061214 41475540
1056 41475540 41752361 41513031 41160858 41132809 41372177 41439777 41358921 41056957 41216770 41831310 41162369
1066.6 41162369 40444180 40670284 41387070 41403057 40821796 41283745 41177979 40748066 40567215 40123058
1076.3 40123058 40088322 40042076 40123943 39928452 39406723 38852875 38506321 38573639 38825527 39145248
1085.9 39145248 39053982 38878609 38343193 38212944 38295887 37284290 36376019 35757999 35420341 34989567
1095.6 34989567 33854675 32470982 31378857 30541136 29409985 28310902 27381039 26959444 26095430
1104.2 26095430 24648933 23510477 22496004 21771427 20650597 19679430 18893501 17999168 17030743
1112.9 17030743 16021587 15508741 15161555 15298095 15256862 15415326 15505409 15334519 15335574 14986843
1122.6 14986843 15441752 15755705 15793325 15882895 16173456 16588106 16300482 16517988 16387712 16174543
1132.2 16174543 16256186 16084635 15834286 15391705 15108298 14186731 13651247 13452491 13137113 12632146
1141.9 12632146 11542079 11377836 11515162 11439885 10854710 10131020 9968391 10073072 10081265 9751550
1151.5 9751550 10029093 10033084 9852736 9706173 9689953 10089958 10030021 10377254 10698167 10922276 11115129
1162.1 11115129 11355929 12034139 12144403 12323236 12983612 13638651 13919111 14282556 15175182 16483616
1171.8 16483616 17418831 17538630 18079460 18965313 19855038 20638878 21622049 22615734 23263201 24268877
1181.4 24268877 25025917 25843613 27092436 28043167 28548557 29183733 29888065 30383909 31125509 31687784
1191 31687784 32220108 32609764 32951893 33644440 34499161 35563992 35956673 36500198 37291733 37415264
1200.7 37415264 37807171 38542519 39180508 39715012 40328484 40585155 40679119 41011658 41339672 41965469
1210.3 41965469 42283321 42395866 42852493 43054768 43244583 43873646 44062355 43638371 43651550 43971806
1220 43971806 44261070 44345959 44397079 44708717 44665691 44520233 44597740 44760460 44868145 44937107 45210724
1230.6 45210724 45376900 45189095 44817047 44958344 45361778 45278458 45178925 45393692 45928619 46333557
1240.2 46333557 46136810 46009586 46174129 45996250 45765526 45940262 46194565 46123154 46022575 46302658
1249.9 46302658 46440319 46481152 46556480 46520672 46400208 46193913 46379120 46478367 46551987 46901127 46915047
1260.5 46915047 46835239 46774273 46860149 47074383 47275200 47461784 47613239 47839195 47804451 47700176
1270.1 47700176 47878796 48371780 48609905 48373447 48448673 48798641 49083664 49230949 49389858 49569099
1279.8 49569099 49654442 49955170 50195614 50291744 50830082 51281738 51123829 51197323 51436123 51559174
1289.4 51559174 51777325 51587151 51558792 52049103 52267246 52435509 52586468 52502670 52838696 53370537
1299 53370537 53562698 53641083 53664078 53706963 53757240 53915668 54201046 54345665 54388561 54353371 54359657
1309.7 54359657 54390472 54516712 54767628 54794712 54642010 54496777 54549980 54710712 54904598 55199966
1319.3 55199966 55379280 55441525 55340878 55313560 55504673 55703587 55723408 55528805 55592419 55812920
1328.9 55812920 55852642 55924660 56050308 55963104 55748158 55842346 56060421 56113819 55983974 55855511 55922661
1339.6 55922661 55961510 56201317 56339882 56088104 55899544 55983585 56258648 56333363 56271400 56252583 56324093
1350.2 56324093 56461445 56223125 55998810 55909824 56011467 56320354 56222366 56246155 56382858 56093540
1359.8 56093540 55553982 55317635 55470493 55423210 55579075 55798504 55740856 55626667 55492157 55399509
1369.4 55399509 55345238 55345760 55247902 54930069 54712925 54897598 55127209 55094807 54954842 54839275 54824665
1380.1 54824665 54821587 54696892 54663460 54697578 54631374 54721493 55018810 54819901 54648487 54858727 54959530
1390.7 54959530 55061359 54948681 54797325 54886513 54934387 54962135 54777763 54673668 54526245 54305122
1400.3 54305122 54239517 54129314 54258072 54320705 54142948 54178711 54349293 54379265 54213341 54193295 54132187
1410.9 54132187 54059559 54050930 53974453 54067383 54145050 53887398 53540760 53365166 53240700 53606846 53849957
1421.5 53849957 53941280 53882057 53508385 53708168 53939137 53889236 53912731 53859127 53955784 54107170 54258503
1432.1 54258503 54350548 54508389 54815067 54872677 54692780 54768539 54992489 55074631 55230057 55451187
1441.8 55451187 55371201 55405605 55470818 55551895 55740520 55950649 56034386 55993195 56070934 56182987 56330936
1452.4 56330936 56392975 56437218 56226654 55956913 56295567 56217815 56591541 56872456 57066261 57115299
1462 57115299 56998550 57134098 56952793 57113850 57541206 57758698 57920677 58059216 58027264 57796116
1471.7 57796116 58195675 58500919 58773613 59182758 59555897 59909096 60093128 60235008 60215775 60321850
1481.3 60321850 60658535 60730701 60937538 60959034 60726780 60872433 61159943 61441494 61543900 60977638
1491 60977638 60696785 60782139 60856922 60918934 60925339 60354908 60574196 60630253 60328793 60448128 60300259
1501.6 60300259 60059689 59881805 59779312 59620838 59062115 58618603 58840019 59358143 59397823 59206203
1511.2 59206203 58791893 58505783 58439491 58117203 57684925 57049885 57338085 57574921 57427456 56974525
1520.8 56974525 56554554 56730934 57133022 57536076 57384315 57392002 57529938 57192112 57056553 57077557
1530.5 57077557 56931477 56617386 56144863 55903530 56235035 56143250 55962814 56357697 55972782 54887188
1540.1 54887188 55884968 56372543 55987930 55855984 55909378 55662331 55630177 55653381 55816246 55721027
1549.8 55721027 55581879 55908939 55983177 56039810 55926289 55813126 55850132 55290886 54766544 56795616
1559.4 56795616 56680645 56397259 56531277 56710937 56915321 56951912 56961636 57129742 56996956 56777996
1569.1 56777996 56845654 56862843 56806332 56862263 57037163 57126377 56746002 55658760 56131741 56409615
1578.7 56409615 56577427 56612621 56068214 55779949 55803852 55839088 55597328 55306824 55233360 55098961
1588.4 55098961 55035881 54781418 54514706 54133812 53788902 53646324 53527527 53524342 53287533 53001362
1598 53001362 52701332 52327106 51851566 51785213 51896130 51479160 51166149 50911938 50707874 50409977
1607.6 50409977 50276394 50031551 49514984 49455555 49313091 49121525 48871738 48868843 48564835 47490791
1617.3 47490791 47812973 47849625 47830048 47562790 47276707 47040989 46959007 46834446 46543320 46598064
1626.9 46598064 46257923 46219479 46334435 46203079 45930721 45645782 45766098 45539150 45231907 45228428
1636.6 45228428 45243454 45171253 45123821 45374287 45353634 45397686 45218124 45334087 45566631 45113888 45157349
1647.2 45157349 45031757 45332825 45528095 45856552 46312420 46301365 46004864 45726856 46116482 46494820
1656.8 46494820 46706650 46656960 46859726 47372356 47805134 47866634 47363808 47710613 48091751 48311199
1666.5 48311199 48454052 48323002 48136181 48474354 49070904 49322964 49551884 49797421 50021763 50033020
1676.1 50033020 50251266 50888084 51267487 51369114 51395058 51733128 52158089 52069908 52522861 52900307
1685.8 52900307 53187286 53343533 53528381 53848225 54223961 54736240 55168041 55478241 55698765 55964626
1695.4 55964626 55965820 56581604 57143787 57433193 57897377 58020569 58576778 59000343 59237991 59445412
1705 59445412 59609840 59938530 60312397 60669994 60968399 61297405 61596985 61829784 62083778 62029396
1714.7 62029396 61928867 62383965 62892712 62344517 62582329 63080887 63320496 63446609 63467152 63503670
1724.3 63503670 63710705 63990810 64175499 64332085 64446877 64142433 64128044 64369179 64454842 64555092
1734 64555092 63798882 64076790 64645157 65143326 65745827 65680359 65215599 65441338 65293243 65338837
1743.6 65338837 65863823 66170982 66537491 66776001 66907394 67019470 67267769 67333092 67418915 68006981
1753.3 68006981 68283730 68379944 68586121 68542030 68674385 68881554 69185448 69437172 69163002 69271431
1762.9 69271431 69628708 69752907 69707062 69774872 69873566 69770760 70016380 70143486 69980446 69956207
1772.5 69956207 69968956 70241821 70420113 70583328 70785194 70809654 70746109 70576408 70622879 70825607
1782.2 70825607 70906136 70976486 70967079 70894455 70973946 71003387 70946617 71129997 71355232 71432991 71295044
1792.8 71295044 71402931 71681786 71592781 71464775 71704056 71915665 71511978 71260696 71469582 71447823
1802.4 71447823 71835503 72055397 71968002 72021187 72029060 72102997 72145691 72002953 71768570 71863480 71976364
1813 71976364 72094856 72345634 72436996 72528229 72409470 72284492 72389122 72475647 72522346 72370590 72282120
1823.7 72282120 72266357 72171982 72218895 72304611 72435516 72601967 72559906 72551277 72683189 72746048 72769295
1834.3 72769295 72708305 72816742 72917130 72732117 72711899 72654373 72643997 72717484 73019440 73255028 72486198
1844.9 72486198 72498985 72766068 72865456 72871559 72863091 72995537 73081085 73111908 73058029 73115044 73182449 73111229
1856.4 73111229 73024406 72948120 72998116 72990059 73010033 73021500 72912262 72882935 73048965 73061958 72808449
1867.1 72808449 72846581 72857941 73003784 73317268 73400429 73391937 73467941 73522484 73181358 73072113 73270309
1877.7 73270309 73302299 73320702 73220924 73224594 73284325 73266945 73157524 73143532 73353996 73366318 73312393
1888.3 73312393 73245827 73237373 73290970 73236671 73255936 73304924 73340485 73392227 73545746 73628006 73474197
1898.9 73474197 73257820 73198143 73257095 73224945 73396957 73562225 73503357 73566238 73507088 73348915 73342537
1909.5 73342537 73380875 73497978 73622665 73548325 73370193 73323029 73458122 73547638 73287071 73217506 73345398
1920.1 73345398 73278900 73303535 73331528 73255394 73306587 73233124 73166382 73219376 73267799 73340744 73359619 73461411
1931.7 73461411 73427040 73302628 73322227 73240089 73323288 73363686 73270340 73321022 73312363 73326912 73208122
1942.3 73208122 73044785 73074532 73072769 73209000 73432030 73408638 73281334 73395195 73486496 73380196 73187439
1952.9 73187439 73125114 73248001 73258484 73282593 73247833 73147430 73186211 73165741 73088516 73122627 73250504
1963.5 73250504 73338936 73353683 73191261 73003868 73088783 73233315 73203331 73076744 73145134 73186043 73164688
1974.1 73164688 73237694 73282326 73419411 73416817 73185112 73046188 73106949 73098145 72882431 72831985 72877434
1984.7 72877434 72782227 72795700 72991394 73138161 73199104 73159958 72968529 72705978 72629181 72754669 72779160
1995.3 72779160 72868660 72972649 72813255 72789742 73011017 73246307 73297531 73207275 73016090 72796997
2005 72796997 72711304 72724976 72839691 72815193 72856750 72924950 72710968 72601379 72503662 72432983 72578285
2015.6 72578285 72693909 72731682 72741196 72650360 72615051 72662834 72501221 72441116 72461533 72343208 72398064
2026.2 72398064 72472443 72532127 72600662 72511093 72428581 72434441 72397263 72361389 72427002 72548241 72626762 72502106
2037.7 72502106 72379990 72346611 72261139 72253563 72223579 72168671 72193939 72203751 72147308 72121132 72200378 72332169
2049.3 72332169 72456238 72403809 72313087 72285690 72073669 71843193 71850098 71992966 72122322 72240959 72245621
2059.9 72245621 72027603 72005363 72232040 72184013 72026169 71972496 71885162 71893311 71948296 71946114 71844894
2070.5 71844894 71699081 71595444 71494995 71394012 71409294 71591011 71520729 71372421 71378838 71207695
2080.2 71207695 71160027 71310806 71474121 71576096 71488266 71302414 71241547 71440102 71519630 71390602
2089.8 71390602 71329147 71351227 71340370 71254494 71233871 71257660 71380119 71555984 71487450 71283279 71280556
2100.4 71280556 71328033 71313904 71408607 71452309 71536003 71576111 71479256 71531868 71571030 71578880 71629547 71688087
2112 71688087 71697983 71615234 71481972 71361282 71410187 71438370 71501816 71699516 71691895 71508675 71431831 71442207
2123.6 71442207 71513519 71765381 71783279 71580734 71582695 71586143 71542793 71454773 71401947 71421364 71318008
2134.2 71318008 71310249 71531548 71580750 71351639 71290390 71373512 71381927 71493080 71617752 71565544 71552483
2144.8 71552483 71619797 71544243 71529610 71691704 71783501 71780701 71771942 71694000 71557747 71545349 71664474
2155.4 71664474 71689995 71588585 71624062 71725075 71812859 71835373 71616798 71564178 71718239 71812241 71855682
2166 71855682 71757820 71495682 71332474 71619659 71814690 71635376 71594490 71629326 71620438 71695244 71754723
2176.6 71754723 71599098 71513626 71628502 71686707 71717331 71678993 71639107 71675690 71662254 71589500 71554092
2187.2 71554092 71548576 71540314 71552574 71562660 71700371 71877541 71888733 71786758 71759689 71844070 71913322
2197.8 71913322 71948616 71796799 71649742 71695778 71782829 71899147 72013893 72088707 72061470 72100212 72156158
2208.4 72156158 72153191 72087036 71942192 72068359 72118401 72036774 72116417 72057945 71976669 72050156 72135056
2219 72135056 72103050 72099037 72086037 72008850 72068123 72159172 72204346 72210304 72187042 72118423 72125015 72243782
2230.6 72243782 72198456 72063210 72067947 72057205 71946075 72000351 72014206 72007187 72120499 72052238 72043694 71993675
2242.2 71993675 71867493 71875389 71861122 71935829 71963234 71961281 72140778 72307884 72213730 71951584 71904724
2252.8 71904724 72138786 72308861 72241005 72128075 71939644 71838142 71993759 72111168 72134140 72037155
2262.4 72037155 71883095 71847923 71926727 71970573 71962463 72019180 72090790 72246269 72348129 72211372 72055885
2273 72055885 72058800 72111694 72128357 72169525 72150932 72094360 72066200 72163132 72378128 72350632 72038857 71892250
2284.6 71892250 72066856 72146904 72162880 72259300 72208549 72102585 72008896 71949150 72042747 72143845 72093575
2295.2 72093575 72150230 72216217 72155800 72248459 72199760 71944000 71821968 71991394 72231270 72263000 72300529
2305.8 72300529 72247063 72185295 72180885 72036461 71919632 71987007 72248596 72212677 71963867 71953590 72105598
2316.4 72105598 72348038 72390594 72289574 72227364 72133148 72158676 72185471 72070587 72126564 72229279 72022377
2327.1 72022377 71932350 72148354 72125259 71978661 72454941 72846024 72504753 72374741 72443130 72155731
2336.7 72155731 71994675 72214638 72305191 72382698 72503967 72228783 72140793 72244148 72261765 72434189
2346.3 72434189 72402641 72352119 72555733 72641373 72549530 72417091 72243973 72570740 72818672 72765106 72870514
2356.9 72870514 72818329 73157600 73086197 72646858 72748199 72627281 72547874 73190430 73604858 73138519
2366.6 73138519 72800537 72829247 73049515 72977875 72606018 72504074 72497795 72512260 72314774 72292206 72387993
2377.2 72387993 72383881 72501999 72314354 72220535 72369583 72456329 72490860 72431450 72342018 72215385 72312630
2387.8 72312630 72345139 72253281 72413055 72534531 72575745 72556976 72489609 72450783 72507240 72504906 72342506
2398.4 72342506 72285583 72307388 72344269 72334991 72399139 72438492 72414520 72503929 72517494 72522362 72353333 72192039
2410 72192039 72304611 72450890 72547615 72481705 72410416 72329674 72370895 72443481 72238548 72104805 72144714
2420.6 72144714 72276443 72283890 72222755 72289833 72344307 72323021 72199722 72199928 72244423 72229736 72210793 72111115
2432.2 72111115 72105698 72131454 72039093 71899109 71862648 71932999 72065323 72176926 72084389 71976143 71878540
2442.8 71878540 71852226 72051651 72098557 72013031 72041161 72019684 71952751 71915482 71888519 71898590 71964272
2453.4 71964272 71958878 71796631 71694435 71681885 71688255 71638283 71635040 71879860 71901741 71726303 71715080
2464 71715080 71765549 71780800 71661240 71586174 71498627 71527237 71682091 71611969 71593987 71659462 71652901 71500809
2475.6 71500809 71473312 71619247 71604912 71596603 71390907 71274513 71466805 71614441 71694176 71524994 71452286
2486.2 71452286 71428703 71334198 71420319 71312912 71215858 71325928 71371094 71290154 71192535 71234192 71236916
2496.8 71236916 71152351 71136292 71236702 71290672 71150299 71060326 71046761 71011787 71115982 71125359 70888451
2507.4 70888451 70932762 71237556 71283455 71151039 71003067 70890816 70936073 71040939 71089424 71086060 71131416
2518 71131416 71177261 71061134 70913040 70856270 70870529 70801079 70753571 71019180 71133858 70936134 70809341
2528.6 70809341 70769249 70857086 70889153 70875458 70951126 70859169 70760345 70646164 70529152 70739410 70886551
2539.2 70886551 70832115 70796822 70703087 70625328 70596466 70725494 70895119 70874695 70763817 70535271 70404083
2549.8 70404083 70469833 70565506 70659683 70522377 70376083 70479568 70525131 70549942 70682526 70748894 70586540
2560.4 70586540 70334312 70311424 70354195 70367065 70420349 70382004 70466003 70501648 70286507 70217216 70276802
2571 70276802 70308647 70380379 70470291 70359581 70195053 70250999 70233269 70244942 70455132 70514732 70366409
2581.6 70366409 70184547 70045334 70048515 70200996 70269737 70206253 70111420 69989861 69920860 69879341 69720688
2592.2 69720688 69765816 70040092 69926407 69861290 70087135 70115456 70096497 69967079 69816994 69707825
2601.9 69707825 69559654 69584877 69596336 69620453 69734840 69757851 69668701 69591286 69562958 69499321 69561806
2612.5 69561806 69705284 69688271 69636909 69674744 69578362 69498283 69579788 69481789 69428040 69532890 69587273
2623.1 69587273 69584358 69476974 69360573 69262459 69267609 69297279 69261932 69272263 69271149 69329987 69305122 69137230
2634.7 69137230 69064743 69109291 69203163 69129593 68961578 68938133 68862526 68742302 68813599 68913002 68838707
2645.3 68838707 68711395 68674324 68733711 68823555 68774292 68529510 68333176 68320290 68425247 68558815 68589737
2655.9 68589737 68559662 68574585 68580688 68596657 68584229 68434975 68325378 68290199 68169228 68034111 68069969
2666.5 68069969 68287361 68380531 68299408 68245766 68128235 67945938 67963249 68070511 68000771 67979866 68021294
2677.1 68021294 67983017 67999756 68046333 68009125 67845360 67697189 67686066 67766052 67740196 67624344 67641281
2687.7 67641281 67672501 67670464 67642761 67682922 67810753 67824364 67769142 67656128 67553986 67545723 67550751 67425903
2699.3 67425903 67331955 67414993 67405251 67369514 67361755 67360313 67350815 67294533 67259422 67266022 67360001 67222282
2710.9 67222282 67074120 67219788 67326828 67290352 67055710 66886665 66935669 66983261 66899429 66856728 66937851
2721.5 66937851 66898071 66870880 66830902 66795868 66813072 66746727 66732117 66787712 66827667 66655525 66448822
2732.1 66448822 66426018 66541969 66623680 66443108 66349083 66357506 66353310 66416451 66390327 66249626 66108177
2742.7 66108177 66190781 66375481 66435547 66377869 66365662 66356667 66166672 66068001 66137657 66319397 66331619
2753.3 66331619 66025620 66020683 66199486 66090790 66044464 66061714 65917221 65889359 65903381 65868896 65886116
2763.9 65886116 65882187 65833961 65763771 65833237 65790955 65567146 65451065 65405228 65471558 65522446 65522110 65598579
2775.5 65598579 65688164 65573601 65354233 65347984 65337387 65256020 65140694 65076370 65171188 65175346 65106506
2786.1 65106506 65087006 65140137 65172173 65074982 64956856 64977783 64946327 64658485 64510948 64611816 64676361
2796.7 64676361 64618370 64506729 64371841 64306664 64371613 64327873 64268822 64350212 64455338 64410637 64230164
2807.3 64230164 64019997 63798454 63830776 63955597 63991970 63943432 63841007 63863266 63716293 63603374
2816.9 63603374 63657913 63509136 63363983 63370846 63315704 63183758 63168983 63146736 63069984 62965340 62765095
2827.6 62765095 62657276 62686722 62758854 62726936 62547890 62330124 62273937 62367348 62312511 62105850 61875832
2838.2 61875832 61713219 61581261 61504131 61417027 61317238 61286514 60982643 60645676 60515434 60316429
2847.8 60316429 60017456 59742088 59615761 59507187 59437759 59342472 59252399 59318050 59314434 59290047 59259640
2858.4 59259640 59312363 59452099 59299488 59032223 59006516 59038376 59054562 59083195 58862591 58601040 58513485
2869 58513485 58511501 58499962 58278591 58138142 58222431 58310452 58254593 58083088 58067856 58081264 57970085
2879.6 57970085 57859108 57836369 57890106 57819370 57630161 57558144 57597565 57613842 57543831 57327248 57097851
2890.2 57097851 57043404 57028172 56784424 56492756 56479519 56661583 56804066 56625080 56326149 56239105
2899.9 56239105 56174862 56122623 56180374 56269615 56252403 56078800 55831978 55700302 55667770 55551956 55536133
2910.5 55536133 55526390 55341866 55246857 55269016 55159634 55032364 55020382 54881718 54756729 54667412 54584515
2921.1 54584515 54526665 54268894 54179592 54297249 54383450 54315952 54174248 54251541 54239887 54259880 54415848
2931.7 54415848 54465096 54470837 54388103 54416794 54585102 54675465 54793465 54982601 55014446 54879837 54865570
2942.3 54865570 55073425 55271889 55203571 55027020 55017799 55243282 55379948 55171799 54960701 54915592
2952 54915592 54984276 55112934 55179325 55111546 54946434 54792084 54730553 54898129 55079800 55082172 55043392
2962.6 55043392 55139622 55415531 55449207 55333996 55393124 55353596 55351910 55454414 55434727 55536362 55722088
2973.2 55722088 55862293 56127197 56291965 56270786 56249466 56320885 56499474 56621021 56756165 56930862
2982.8 56930862 56988224 57015862 57067642 57128567 57335548 57550201 57466824 57380421 57631237 57971649 57953262
2993.4 57953262 57801739 57941715 57994358 57949261 57951775 57852184 57840466 57872017 57932583 58042709 58117641
3004 58117641 58198635 58265202 58208588 57987034 57979244 58143925 58157196 58121578 58029064 57929871 57862492 57863335
3015.6 57863335 57876316 57832165 57843494 57817410 57819145 57719307 57500496 57485023 57530266 57584190 57552517 57420948
3027.2 57420948 57468876 57517654 57391514 57237595 57189007 57242004 57322880 57272533 57019711 56865940 56922417
3037.8 56922417 56968704 56926212 56803204 56701550 56730404 56740509 56695484 56650589 56505268 56365341 56414860
3048.4 56414860 56482128 56334438 56276512 56398384 56350883 56179935 55951538 55821751 55883793 55845783 55766270
3059 55766270 55777958 55744160 55633385 55548016 55470989 55510883 55504162 55143436 55018291 55253994 55303436
3069.6 55303436 55194046 55021805 54939224 55013058 55002228 54932293 54862495 54777092 54717113 54546753 54513481
3080.2 54513481 54655987 54614357 54570797 54496597 54480003 54547886 54417549 54278305 54190258 54310719 54422642
3090.8 54422642 54243603 54065121 53912117 53901630 53896217 53747654 53663498 53723381 53769264 53525814 53388241
3101.4 53388241 53468067 53378040 53319931 53317699 53052040 52858475 53041470 53121593 52989887 52909340 52967094
3112 52967094 53000122 52783020 52558582 52544945 52627338 52620659 52611881 52558899 52401428 52367424 52257977 52079071
3123.6 52079071 52044586 51941910 51686573 51494644 51487030 51566429 51630104 51607353 51518173 51338913 51275272
3134.2 51275272 51309124 51154350 51032146 50951153 50889076 50764221 50575272 50673199 50796185 50715584 50527142
3144.8 50527142 50470963 50499336 50313427 50200806 50185894 50141113 50076115 49880653 49701439 49651512 49700367
3155.4 49700367 49690701 49474003 49301517 49286495 49183823 49093925 49126663 49154449 48994671 48646835 48568481
3166 48568481 48591900 48424267 48403809 48450985 48440037 48463081 48310638 47983864 47856617 47838512 47742111
3176.6 47742111 47762123 47795223 47674831 47625866 47708763 47573612 47277721 47088181 46906734 46820583 46853390
3187.3 46853390 46868317 46890038 46845924 46621983 46497787 46491173 46308159 46209476 46198002 46119545 45929298
3197.9 45929298 45773437 45952438 45901482 45694160 45773598 45690239 45528030 45518566 45430130 45352512 45385178
3208.5 45385178 45227154 45093685 45095272 44868561 44770096 44875839 44875973 44766197 44598072 44488132 44374119
3219.1 44374119 44301758 44276390 44289066 44221577 43929070 43832733 43877007 43776291 43656631 43533661 43537949
3229.7 43537949 43566868 43416828 43287708 43256283 43289433 43378750 43368443 43233631 43057274 42899002 42833183
3240.3 42833183 42839027 42871605 42701946 42438686 42456314 42411709 42306564 42373299 42291447 42152248 42116074
3250.9 42116074 42132912 42168633 42129215 42035988 41824142 41555889 41488411 41507812 41403881 41457775 41594841
3261.5 41594841 41514034 41446701 41343555 41285069 41412975 41375690 41132889 40853409 40683933 40682938 40847141
3272.1 40847141 41043606 40957188 40700611 40558590 40489086 40482971 40549778 40524178 40510414 40390430 40101410
3282.7 40101410 40036674 40008728 40040871 40128571 40064980 40088844 40012123 39857922 39839062 39849056 39748623
3293.3 39748623 39590374 39581585 39592583 39524281 39365692 39271122 39316319 39384308 39423355 39269985 39146683
3303.9 39146683 39085018 38885834 38767872 38877377 39049366 39036053 38879578 38673870 38592678 38668079
3313.6 38668079 38614632 38384686 38283386 38382240 38254955 38099747 38199501 38185566 37967655 37753750
3323.2 37753750 37699303 37674454 37636242 37618217 37505047 37410286 37383232 37308323 37217468 37141899 37047073
3333.8 37047073 37041637 36982841 36794170 36759396 36835701 36817085 36711800 36724049 36691090 36484051 36351395
3344.4 36351395 36235638 36065811 35931217 35923988 35917900 35917877 35903076 35747631 35707581 35623779 35451576 35337700
3356 35337700 35311581 35372036 35182281 34948559 34829460 34802151 34857643 34791225 34816727 34899948 34807194
3366.6 34807194 34577881 34478260 34407505 34128845 34028687 34029366 34002068 34053574 34019165 33887966 33653049
3377.2 33653049 33525513 33517998 33503189 33610855 33555489 33361736 33286098 33182152 33188549 33256927 33224621
3387.8 33224621 33174191 32999794 32850407 32787895 32733498 32893936 32954220 32672546 32521854 32578720 32529373
3398.4 32529373 32452454 32400570 32447090 32540119 32466064 32463989 32478470 32363804 32308544 32209793 32114281 32095406
3410 32095406 32087872 32160229 32172089 32110306 32062531 31937342 31824217 31853092 32091743 32330746 32295250
3420.6 32295250 32143223 32054058 32055614 31981262 31907091 31964293 31960257 31938944 31861403 31857090 31956890 31951189
3432.2 31951189 31989454 32071331 32095943 31978226 31922186 31979294 31987026 32038994 32018703 31962524 32002762 32219765
3443.8 32219765 32291451 32069157 32029987 32164047 32239990 32181282 32184483 32320820 32396103 32341187 32240551
3454.4 32240551 32380257 32499432 32596615 32627251 32562202 32816528 32950928 32937111 32991867 33018330 33021397
3465 33021397 33006302 33105465 33109097 33059338 33058548 33191219 33394089 33554802 33705582 33541058 33418762
3475.6 33418762 33558983 33664536 33600159 33527615 33823471 34005527 33865971 33904930 34123295 34250675
3485.2 34250675 34329105 34457176 34494087 34439259 34338795 34446022 34601788 34568073 34726498 35077873
3494.9 35077873 35231853 35050915 34944847 34904682 34838871 35000454 35274044 35439754 35362316 35347359
3504.5 35347359 35479488 35630386 35753540 35834236 35848682 35723011 35884392 36087929 36091835 36196968
3514.2 36196968 36361050 36446259 36402561 36567547 36819557 36866043 36832024 36902710 37201859 37272964 37305573
3524.8 37305573 37528522 37530224 37407375 37400826 37486027 37683456 37864407 37888268 37959469 38141003 38414604
3535.4 38414604 38471554 38390209 38564678 38580391 38645630 38836399 38933983 38973789 38934708 39033855 39157562
3546 39157562 39404564 39585915 39727425 39982021 40189419 40410549 40224422 40117569 40230778 40371624
3555.6 40371624 40644379 40796753 41010487 41085087 41038712 41047134 41210865 41375332 41354015 41831734 42173683
3566.2 42173683 42140541 42234303 42122871 42392399 42602585 42640301 42710022 42923466 43075481 43121353 43328842
3576.9 43328842 43385132 43709362 43999847 43912750 43994434 44118660 44296211 44561867 44986946 45043125
3586.5 45043125 44901840 45336575 45346775 45532341 45841103 46102119 46294254 46293362 46596760 46630711 46733669
3597.1 46733669 47075130 47234016 47412689 47340988 47420982 47746429 48025146 48224827 48397736 48672314
3606.8 48672314 48808464 49169819 49248245 49217991 49756378 49956837 49951302 50027863 49930500 50261906 50451477
3617.4 50451477 50722160 51274914 51106323 51166569 51707439 51975822 52065094 52416027 52802998 53090050
3627 53090050 53689991 53735889 52939610 53449520 53908260 54326164 54399502 54268330 54685112 55022446
3636.6 55022446 55334396 55501484 55513565 55769531 56003155 56217403 56377575 56517490 56819237 57256596
3646.3 57256596 57212055 56956394 57332512 57594952 57676716 57513809 57998192 58653545 59099842 59633785
3655.9 59633785 59103500 59134666 59607597 59819710 60075989 60081146 60348583 60539337 60561729 60659767 60741417
3666.5 60741417 61287212 61472744 61566189 61989521 61155113 61329933 62045700 62714264 62799690 61592396
3676.2 61592396 61835297 62302391 62608398 62616596 62705921 63015247 63154312 63203880 63321419 63433941
3685.8 63433941 63827492 64434830 63575924 62990860 63522026 62989719 63182453 63968708 64041168 64042244
3695.5 64042244 64075989 64049065 64219971 64272453 64579269 65046570 64424103 64073936 64648979 64823730
3705.1 64823730 64746208 64734917 64887390 65201767 64666656 65187157 65965820 64768379 64825386 65141609
3714.8 65141609 65273346 65377380 65426857 65541367 65434616 65446297 65773659 65694832 65418762 65708382
3724.4 65708382 65699997 65744011 66030365 66073914 66138634 66077164 66602859 66381851 65325607 66162910 66730453
3735 66730453 66126549 65878563 65851738 65780495 65833405 66232384 66080956 66116348 67246635 67338028 65134773
3745.6 65134773 65489365 66034180 66846390 66370575 65015816 66308968 66498436 65679848 66020531
3754.3 66020531 66289169 66500374 65979759 66196663 67039902 66555679 66162727 66669655 66837357 66615982
3763.9 66615982 66997337 66941422 66421234 66677460 66987160 66890343 66212837 66429794 66713982 66762215
3773.6 66762215 67017563 66949776 66755493 66794144 67222694 67165031 66376503 66520103 66706139 66933937
3783.2 66933937 67137466 66750328 66572243 66802948 67008347 67076324 67098953 67006775 66877609 66902222
3792.9 66902222 66909668 67064377 67496269 67169662 66480667 66647446 67014175 67701103 67378113 65753601
3802.5 65753601 66309669 66897636 67234703 67651520 66830391 66418930 66933578 67196487 67102615 67093422
3812.2 67093422 67189392 67231590 67547699 67406830 66174377 66407227 66844643 67272423 67826805 66336975
3821.8 66336975 65971268 66402420 66595627 67081528 67507973 67337372 67249107 67151588 67207146 67336754
3831.4 67336754 66756760 66865288 67522087 67042221 66779282 67665886 67077980 66290833 66885094 66618988
3841.1 66618988 66603188 67362450 67401627 66917099 67070953 67149651 67184303 67278282 66867134 67035324 67400505
3851.7 67400505 66439148 66777962 66027916 66091408 67062630 67061516 66919563 67126411 67230049 67542107
3861.3 67542107 67191154 66781937 67098595 66655235 66293602 66801521 67385574 68035889 67278435 66087555
3871 66087555 66392143 67066422 67431007 66430229 66472038 67070129 67064812 66945305 67225845 67178261 66594398
3881.6 66594398 66904816 67006073 67300888 68105301 66911240 66646736 66955673 66870079 67197464 67222687
3891.2 67222687 66484329 66466805 66743378 66747498 66901382 67055038 67290733 67535606 66757896 67048409
3900.9 67048409 67025810 66249130 66857491 66884895 66659286 66776123 66888893 67190979 67197792 67036003
3910.5 67036003 66804749 66821472 67007111 66927971 67075371 67447845 67228325 66685471 66920326 66986786
3920.2 66986786 66579742 66823051 66988846 66995102 66828499 66468018 66766388 67080528 67208466 67035934
3929.8 67035934 66767029 67006142 66812599 66523972 66699989 66877480 66970940 66906296 66875465 66759567
3939.5 66759567 66733986 66982040 67060043 67003723 66860191 66717148 66948845 67114555 66739883 66579384
3949.1 66579384 66721718 66772766 66873337 66953636 66852943 66699699 66797287 66823715 66713402 66797394 66721855
3959.7 66721855 66646034 66621262 66631355 66789444 66879463 66934494 66672829 66451118 66639290 66715584 66765778
3970.3 66765778 66988106 67163902 67110916 66871567 66776588 66922180 66913574 66645859 66405731 66442467 66644440
3980.9 66644440 66726746 66806053 66783936 66727585 66777504 66706039 66666206 66766655 66871376 66726387 66568024
3991.5 66568024 66609787 66709213 66890625 66723495 66606606 66812378 66846344 66851227 66755959
4000.2 66755959
##END=$$ End of the data block
