##TITLE=(NH4)2SO4 $$ Begin of the data block
##JCAMP-DX=5.00 $$ ACD/SpecManager v 10.08
##SPECTROMETER/DATA SYSTEM=Alpha
##DATE=22 Jul 2015 08:20:50
##DATA TYPE=INFRARED SPECTRUM
##DATA CLASS=XYDATA
##ORIGIN=
##OWNER=
##NPOINTS=1765
##FIRSTX=399.76428223
##LASTX=3997.64306641
##MAXX=3997.64306641
##MINX=399.76428223
##MAXY=0.81781673
##MINY=0.16331659
##XFACTOR=1.0000000000
##YFACTOR=1.000000000000000e-9
##FIRSTY=0.73735183
##DELTAX=2.03961372
##XUNITS=1/CM
##YUNITS=ARBITRARY UNITS
##XYDATA=(X++(Y..Y))
399.8 737351835 738885164 741070449 743127227 744625926 746069252 747133136 748139083 749682963
416.1 749682963 751010120 752136528 753716171 754799545 755474687 756914198 758129179 758504510 759534299
434.4 759534299 760630608 760703444 761172533 761689305 760598958 759041548 757937968 757055879 757672846
452.8 757672846 759727061 761349499 763193190 765825272 767470896 768233001 769443989 770220995 770160675
471.2 770160675 770693541 771205783 770932972 771253109 771773398 771261334 770932019 771130443 770603538 769970953
491.5 769970953 769898176 769323409 768391669 767906487 767153442 766065896 765364885 764454246 763090014 762066782
511.9 762066782 761035085 759318173 757665873 756372809 754774809 753220677 752008557 750348866
528.3 750348866 748305678 746539474 744643629 742392063 740275145 738088191 735544086 732984543
544.6 732984543 730468750 727736175 724824548 721780002 718546927 715200424 711680055 708010197
560.9 708010197 704239190 700159788 695690274 690924942 685767829 680247545 674467981 668124974
577.2 668124974 661252558 654003978 645922780 636821866 627195299 616611540 604221046 590334237
593.5 590334237 574870110 556791425 535583317 510837018 481143147 445309550 402811617
607.8 402811617 355291903 309509575 276135385 262662739 269080639 290391237 322878927 367062300
624.1 367062300 422334284 482088447 536320448 579862297 613631189 640205681 661548257
638.4 661548257 679829955 696152985 710073352 722295642 733834267 743967950 752503335 760510504
654.7 760510504 767584145 773376286 778976977 784200609 787724316 790474653 794364870 797761261
671 797761261 800425351 803251028 805447280 806977510 808859527 810480535 811362147 812500656 813677013
689.4 813677013 814077735 814540625 815411210 815748394 815942228 816596687 816906929 816848159 817203760 817497909
709.8 817497909 817353487 817497671 817816734 817677021 817575097 817798853 817684233 817386985 817342341 817158520
730.2 817158520 816763103 816509008 816185057 815611720 815116048 814681053 814056814 813373864 812718928 811956048
750.6 811956048 811157763 810414433 809662879 808855593 807932496 806983113 806110978 805161834 804099023 803073585
771 803073585 801991999 800829470 799848378 798911273 797748089 796666980 795793533 794763565 793634295
789.3 793634295 792638123 791452348 790038526 788872540 787758708 786386907 785220683 784243345 782903552
807.7 782903552 781526864 780388415 778962731 777418077 776216388 774845183 773123860 771650136
824 771650136 770195603 768348277 766671181 765210271 763365149 761505067 760025084 758334458 756403208
842.4 756403208 754752278 753001809 750914037 749056280 747328460 745245039 743116438 741156161
858.7 741156161 738978028 736722291 734677732 732458532 730030954 727797270 725490034 722850919
875 722850919 720393360 718246281 715986907 713776529 711825967 709711671 707355976 705081224 702747822
893.4 702747822 700233281 697829008 695502818 693003178 690526187 688169062 685642660 682975531
909.7 682975531 680373609 677703202 674893677 672100067 669270337 666301370 663321495 660383344
926 660383344 657356441 654224753 651066542 647847593 644512236 641119897 637688100 634148300 630519390
944.3 630519390 626839459 623010457 618974924 614857435 610713124 606478274 602180898 597825646
960.7 597825646 593206108 588154376 582581580 576104343 568668902 562096834 558596909 557255983
977 557255983 556121111 555377841 554882705 553186119 549817502 545392156 540479779 535487473 530549645
995.3 530549645 525481224 520304084 515158892 509929240 504555821 499167681 493695855 488041371
1011.6 488041371 482355982 476607144 470621318 464540094 458461434 452213526 445832253 439441919
1028 439441919 432872385 426027834 419070154 411984682 404642642 397144973 389525354 381673902 373683333
1046.3 373683333 365682930 357586265 349363506 341101259 332702905 324046284 315184593 306164354
1062.6 306164354 296990842 287765652 278586745 269473612 260536462 251987576 243924081 236346841
1079 236346841 229330212 222925082 217161223 212053761 207444474 202982321 198339313 193360522 187962711
1097.3 187962711 182112679 176026866 170383915 166082561 163711846 163316593 164618611 167285040
1113.6 167285040 171078607 175906107 181718037 188418746 195789188 203543738 211572349 220031828
1129.9 220031828 228874579 237716317 246331051 254747033 263069481 271460265 280109227 289130330
1146.3 289130330 298516780 308160990 317974985 327902228 337820500 347523719 356913239 366462529
1162.6 366462529 377117634 389246196 402191699 415116370 427601010 439459234 450615644
1176.9 450615644 461207598 471362799 481037587 490206569 498833925 506801546 514159679 521129370
1193.2 521129370 527748823 534013271 540098727 546065688 551846147 557550848 563231111 568763018
1209.5 568763018 574217319 579699159 585078299 590303600 595500886 600584328 605413258 610079765
1225.8 610079765 614581168 618803382 622901440 627066553 631265581 635536373 639921665 644354582
1242.1 644354582 648921669 653740942 658605456 663331449 667989552 672572553 677056551 681590855
1258.4 681590855 686185479 690621853 694919288 699169099 703320146 707457781 711731255 716008604
1274.8 716008604 720189273 724397004 728568435 732605457 736579537 740444303 744018137 747389674
1291.1 747389674 750601053 753485858 756057799 758404911 760391295 761945128 763162196 763897955
1307.4 763897955 764122009 763948500 763279259 761998653 760265052 758087575 755337894 752086759 748297155
1325.8 748297155 743822515 738716304 733160138 727028728 720266104 712826014 704733133 696406007
1342.1 696406007 687954664 678948283 669164598 658858657 648127198 636763334 624818921 612558246
1358.4 612558246 599466145 584991693 569960833 554776490 538504660 521322250 503020406
1372.7 503020406 482828707 461911410 440417647 417381555 393402845 369259745 343935072
1386.9 343935072 318336487 295140088 273336053 252555072 236069679 225019395 219343379
1401.2 219343379 218815744 222473904 229175135 237731174 247348651 257036239 266031832 274804354
1417.5 274804354 284020334 292264611 299569905 306806564 313821226 320983976 328196973 335064679
1433.9 335064679 342658043 350972325 358119041 364435464 370389700 375925511 381171882 385964900
1450.2 385964900 390260935 394371718 399530232 406169325 412328511 418220848 425209075 432758272
1466.5 432758272 439502507 445978820 453325480 460711926 467275590 473428965 479381830 485172749
1482.8 485172749 490667194 495977581 501323581 506702185 511556387 515981734 520569503 525138915
1499.1 525138915 529306531 532972515 536554396 540621519 544591188 548204124 551669598 554931164
1515.4 554931164 558111191 561157882 564105868 567057371 569893360 572705448 575422764 577961862
1531.8 577961862 580431402 582916081 585184574 587175369 589233160 591507435 593856394 596076190
1548.1 596076190 598169684 600174010 602133632 603956521 605274200 606650293 608714402 610733986
1564.4 610733986 612410784 613739431 614961624 616401851 617567480 618187308 618938684 619831979 620426595
1582.8 620426595 620662510 620595157 620378971 620083988 619648397 619162679 618721545 618206263 617533684 616831601
1603.2 616831601 616072834 615154505 614151359 613167584 612160921 610719860 608977318 608107328 607756019
1621.5 607756019 607180774 606649578 606270909 606207728 606827497 607849121 609089315 610906065 613131404
1639.9 613131404 615566611 618130922 620646060 623516500 626663983 629273713 631622076 634591222
1656.2 634591222 637573063 640062094 642165780 644268215 646279156 647816896 649175107 650700748
1672.5 650700748 651992142 653205395 654681802 656106532 656962931 657253027 658133447 659497321 660809934
1690.9 660809934 661974847 662618220 663104832 663571060 663852692 664875329 665976286 666669130 667540312
1709.2 667540312 668557227 669391692 669849455 669947743 670454681 671578109 672640920 673448384 674167752
1727.6 674167752 674979091 675681531 675665200 675959587 677050292 677777886 678285539 679086149 679876149 680432141
1748 680432141 680747747 681187630 681971133 682674766 683214903 683659792 684002519 684625864 685296893 685767531
1768.4 685767531 686125636 686167419 686446309 687247872 687929690 688334227 688766062 689193189 689670026 690346777
1788.8 690346777 690744758 690763056 691197217 691976130 692487419 692810297 693371594 694081426 694721997 695311368
1809.2 695311368 695832789 696392775 697105169 697821915 698491395 699250638 699963152 700543582 701217353 701855481
1829.6 701855481 702489972 703353226 704255879 705070019 705928445 706738830 707172811 707620084 708511233 709502995
1850 709502995 710353673 711123645 711921811 712665915 713357508 714145839 714985132 715646744 716068923 716622472
1870.3 716622472 717464447 718337238 719092488 719721496 720324814 720993042 721651256 722269595 722817838 723343372
1890.7 723343372 723949909 724543810 725108504 725661218 726199985 726735413 727233171 727685869 728109181 728540957
1911.1 728540957 729060948 729598343 729883075 730101347 730529606 730948389 731329620 731763899 732158124 732458115
1931.5 732458115 732743621 733082414 733421147 733698905 733845830 733938992 734179556 734526575 734826744 735051453
1951.9 735051453 735297978 735579491 735810339 736045659 736337185 736588001 736758411 736962199 737208664 737440526
1972.3 737440526 737688243 737895072 738055229 738283575 738512337 738637447 738784194 738985538 739065826 739113510
1992.7 739113510 739329636 739529669 739604473 739706755 739810944 739850998 739919245 739995718 739964843 739918888 739878774
2015.2 739878774 739664793 739312708 738901734 738161147 737257838 736964464 737080216 736816347 736233830 735603273
2035.6 735603273 734879673 734125078 733476043 732887387 732359767 732003868 731759489 731572568 731563866 731712222
2056 731712222 731871247 732090473 732405961 732689738 732994914 733437419 733881474 734293640 734860182 735579312
2076.4 735579312 736341417 737209857 738205492 739211261 740232944 741304100 742290556 743126452 743913829
2094.7 743913829 744649529 745289087 745946944 746647894 747293174 747951210 748697579 749454796 750254631 751176000
2115.1 751176000 752129793 753071368 754084766 755103111 756020129 756931245 757848620 758670807 759453893
2133.5 759453893 760266006 761039734 761775851 762538254 763288319 764012575 764780164 765560806 766266167 766929507
2153.9 766929507 767583609 768197656 768790424 769375920 769896686 770334005 770750284 771218300 771759689 772329450
2174.3 772329450 772857726 773304224 773722112 774154961 774573445 774986565 775413573 775812864 776158571 776510119
2194.6 776510119 776879251 777230084 777574658 777916193 778260410 778653026 779089153 779509902 779929042 780377984
2215 780377984 780826747 781258881 781682312 782082200 782476187 782911003 783374727 783844113 784332633 784805179
2235.4 784805179 785228789 785659611 786094606 786490202 786883771 787286997 787647486 787989855 788369179 788744330
2255.8 788744330 789094746 789460719 789831340 790185809 790582478 791012883 791401565 791781425 792185485 792548954
2276.2 792548954 792893350 793294311 793685436 794018805 794325292 794581056 794787049 795025945 795278013 795455515
2296.6 795455515 795625806 795853436 796058118 796180606 796253800 796282411 796286821 796353877 796499074 796622515
2317 796622515 796578646 796324730 796063125 796066105 796198547 796101272 795859396 795837045 795917273 795798242 795541286
2339.5 795541286 795232356 794785559 794884503 796504974 798572898 799376369 798666418 797493696 796551466
2357.8 796551466 795922816 795502484 795297146 795405507 795732975 796174586 796742678 797354579 798002362 798806250
2378.2 798806250 799730062 800567806 801200688 801611304 801782846 801800132 801813364 801818371 801745236 801655114 801569104
2400.6 801569104 801427066 801269650 801141620 801007450 800877512 800769448 800638914 800469816 800284803 800101519
2421 800101519 799924731 799753845 799584806 799420953 799270093 799113929 798920751 798701942 798475444 798220098
2441.4 798220098 797958851 797695458 797384381 797065437 796769381 796441853 796099544 795773029 795404077 794993043
2461.8 794993043 794600248 794204295 793764591 793311059 792855382 792392373 791941047 791477382 790957868 790417969
2482.2 790417969 789906740 789389968 788850844 788306117 787722230 787106037 786552310 786031067 785434604 784813225
2502.6 784813225 784223020 783615410 782991290 782393992 781763852 781077087 780430377 779798627 779108584 778436244
2523 778436244 777796030 777100801 776391923 775724113 775033951 774304628 773574591 772812724 772015154 771238863
2543.4 771238863 770455420 769618452 768794835 768013358 767184198 766308188 765446484 764558733 763644159 762766719
2563.8 762766719 761872709 760924578 759996474 759049654 758027256 757012486 756025732 754978776 753884077
2582.2 753884077 752819061 751739860 750621140 749554455 748498440 747346103 746167004 745012283
2598.5 745012283 743831396 742656350 741507649 740311027 739070594 737849653 736601233 735292971
2614.8 735292971 734018862 732770324 731459379 730163395 728918076 727608204 726232231 724870026
2631.1 724870026 723507583 722129881 720773339 719395041 717954159 716527402 715132713 713698208
2647.4 713698208 712230980 710774004 709305704 707816124 706324875 704826474 703310013 701781929
2663.7 701781929 700245023 698683381 697109044 695554972 693999588 692413270 690792918 689102948
2680.1 689102948 687358260 685627997 683903277 682146609 680360913 678547978 676719248 674910367
2696.4 674910367 673089802 671206295 669286668 667344868 665361822 663360655 661360621 659336627
2712.7 659336627 657276809 655193806 653090119 650947571 648770690 646583021 644380629 642163157
2729 642163157 639913380 637612104 635302246 632981598 630590796 628143847 625692844 623212934 620649993
2747.4 620649993 618047416 615454018 612827063 610120177 607325137 604459584 601559639 598645747
2763.7 598645747 595711589 592776239 589850068 586881280 583866954 580878675 577946782 575026155
2780 575026155 572059155 569037080 565978289 562925220 559934020 557005942 554160535 551501453 549093902
2798.4 549093902 546889782 544816554 542850614 540958703 539100170 537325263 535669863 534075618
2814.7 534075618 532537222 531092346 529720128 528392732 527130067 525947869 524829447 523749828
2831 523749828 522691965 521673143 520715773 519809425 518933237 518072188 517184377 516238630 515308857 514470696
2851.4 514470696 513697028 512988091 512370050 511797190 511202037 510545135 509824574 509024441 508126318 507181108
2871.8 507181108 506228983 505244195 504227698 503205836 502142727 501017213 499873847 498703688 497468352
2890.1 497468352 496196270 494916469 493609935 492255509 490836918 489350885 487823844 486260235
2906.5 486260235 484631002 482905746 481064290 479085058 476957381 474740595 472519040 470322251
2922.8 470322251 468165338 466053009 463945925 461827606 459720403 457596272 455406576 453160316
2939.1 453160316 450868756 448515207 446083128 443526804 440842927 438098878 435295075 432407200
2955.4 432407200 429474086 426518083 423545241 420540124 417466313 414365828 411271125 408166230
2971.7 408166230 405107200 402122110 399192959 396323353 393470228 390609741 387764454 384933203
2988 384933203 382148504 379394740 376594692 373807102 371095419 368451566 365931630 363552034 361313283
3006.4 361313283 359276712 357452035 355754912 354084134 352436751 350905269 349531442 348296255
3022.7 348296255 347144276 346018612 344996363 344140142 343397081 342714816 342100620 341664165 341430068
3041.1 341430068 341190100 340731323 340054989 339246541 338266522 337079406 335766703 334351748 332834274
3059.4 332834274 331286103 329713196 328078061 326333851 324415356 322378993 320362270 318417609
3075.7 318417609 316458285 314339221 312057108 309715420 307341963 304983050 302663386 300298363
3092.1 300298363 297924191 295709014 293697059 291736394 289740920 287843794 286175221 284674704
3108.4 284674704 283190399 281827003 280779958 279901206 278998792 278021574 276982278 276079476 275447786
3126.7 275447786 274985552 274525881 274021149 273619741 273409843 273220658 272816718 272274673 271838725 271520197
3147.1 271520197 271290243 271139354 270838797 270298541 269779950 269387841 269016922 268649608 268317491 268005103
3167.5 268005103 267672986 267326832 267022014 266786724 266571283 266337842 266088128 265827358 265588492 265404195
3187.9 265404195 265258998 265119135 264969081 264793664 264598817 264464766 264453709 264509350 264573693 264630079
3208.3 264630079 264701068 264832646 265025675 265263796 265544772 265874654 266247809 266671211 267186195 267828584
3228.7 267828584 268637180 269555032 270326763 270918369 271601230 272489786 273547202 274723202 275884509
3247.1 275884509 276919335 277955651 279168665 280500203 281795472 283059031 284395039 285815626
3263.4 285815626 287296921 288913429 290704072 292424411 293903619 295294613 296719760 298199773
3279.7 298199773 299729109 301287144 302858680 304425478 306037784 307669014 309144020 310419232
3296 310419232 311606318 312839806 314253688 315850675 317347586 318484575 319383115 320333093 321481675
3314.4 321481675 322748631 324032962 325368166 326814294 328317940 329671592 330833316 332005799
3330.7 332005799 333280504 334662378 336153477 337553144 338651150 339556545 340435952 341369301 342423141
3349 342423141 343386799 344039202 344568819 345205992 345905125 346510440 347041428 347709686 348493040 349034876
3369.4 349034876 349177569 349223554 349479556 349900723 350336164 350717157 351082504 351537436 352195710 353060186
3389.8 353060186 353813708 354230583 354584187 355223209 356056303 356603622 356753379 356982619 357491553 358068794
3410.2 358068794 358585179 359011292 359420210 359925330 360482842 361050248 361706883 362500280 363395631 364271194
3430.6 364271194 365169853 366194189 367105603 367753923 368411690 369293094 370330781 371436894 372609049
3449 372609049 373855501 375134677 376427650 377796859 379254371 380643487 382001698 383596033 385343730
3467.3 385343730 386877179 388096929 389286190 390680045 392309904 393971413 395412743 396817118
3483.6 396817118 398389459 399957806 401484609 403109968 404777169 406417876 408078104 409799784
3500 409799784 411479294 413005918 414512604 416106641 417806536 419677466 421554804 423235476 424890578
3518.3 424890578 426718950 428642213 430437893 432044566 433653176 435476422 437521428 439608753
3534.6 439608753 441573262 443484932 445570439 447728723 449604869 451257616 453139901 455186188
3551 455186188 457142293 459184021 461360872 463552594 465831995 468152732 469966143 471337348 473398745
3569.3 473398745 476163894 478789449 481171489 483541876 486048967 488866717 491830647 494109362
3585.6 494109362 495545596 497681260 500697613 503376067 505768001 508433759 511120915 513831913
3601.9 513831913 516847491 519557118 521560907 523604095 526027262 528777957 531598628 533470094
3618.3 533470094 535097659 538101494 541922271 544504464 544398606 544780016 547628880 550536811 552849233
3636.6 552849233 554962695 557008147 559462190 562179565 563528478 562568128 562456250 565057039 567283809
3655 567283809 568162739 569681287 571567357 573143125 575115204 576757550 576582611 576741457 577875376
3673.3 577875376 576851368 576178551 578040779 580225408 582428813 584414721 584477305 582855999 582690537
3691.7 582690537 584309220 586152375 587663829 588353872 588180840 588840902 590757787 592136860 591472745
3710 591472745 589744508 590132654 592202663 593682349 594121933 594070613 593846977 593916476 595176995 596676946
3730.4 596676946 596641183 595086098 593954802 595544159 598828673 599503875 597194135 597730458 599156797
3748.8 599156797 597407401 596617758 598869145 600762188 600872219 601161361 602360904 603149831 603350580
3767.1 603350580 602926254 602630675 603630364 605072260 605607033 605116963 605009258 605472803 605689585
3785.5 605689585 606033742 606705964 607537210 608188629 608366489 608887434 608639240 607050180 607313275
3803.9 607313275 607753158 607021511 608250260 610800505 611497402 610243917 610077441 609540999 608212829
3822.2 608212829 609116256 610585332 611432672 612056196 612529576 613138318 612541616 610685885 610158801
3840.6 610158801 610746682 611602604 613556206 616450250 617498636 612897813 608110607 610063672 613668740
3858.9 613668740 615245938 614829600 614412487 615019798 614502132 613370955 613595486 614637673 616023898
3877.3 616023898 616285086 615981340 616260231 615704417 615774512 616520226 615891457 615973532 617809594 618912220
3897.7 618912220 618296206 616889119 615517855 615423143 616753697 618028104 618821084 619339108 619083762
3916 619083762 618354917 618326962 618828833 618983388 619194925 619761705 619751334 619167328 619157970 619812667 620464921
3938.5 620464921 620649993 620357752 620355070 620652080 620582104 620481730 620759010 621124566 621355534 621499658
3958.9 621499658 621550977 621588945 621752143 621928096 622038901 622161448 622254372 622314692 622481167 622687817
3979.3 622687817 622810125 622921407 623072982 623205423 623293161 623369038 623424530 623488903 623623490
3997.6 623623490
##END=$$ End of the data block
